{"text_format":"1","workbook":"xlsx","n_sheets":8,"sheets":["DKB","Einzelergebnisse","MANNSCHAFTEN+SPIELER","Beamer_1","Dialog","Dialog2","Dialog3","übertrag"],"not_rendered":{"charts":0,"images":1,"macros":1,"external_links":0,"defined_names":48,"comments":1,"pivot_tables":0},"unopened":[],"bounds":{"document_bytes":16777216,"sheet_cells":100000,"rows_first":2000,"rows_last":500,"rows_between":2000,"halvings":0,"cell_chars":16384,"cell_head_chars":4096},"cells_cut":0,"cells_raw":0,"read":"whole","date_system":"1900"}

{"sheet":"DKB","index":0,"n_rows":68,"n_cols":25,"rows_kept":68,"cut":false,"hidden":false,"merged":[[0,6,0,16],[1,13,1,14],[1,15,1,24],[2,15,2,17],[2,21,2,24],[3,13,3,14],[3,15,3,24],[4,13,4,14],[4,15,4,17],[4,21,4,24],[5,13,5,14],[5,15,5,24],[6,11,6,13],[7,3,7,10],[7,11,7,13],[7,17,7,24],[9,1,9,3],[9,7,9,8],[9,15,9,17],[9,21,9,22],[10,1,11,3],[10,7,10,8],[10,10,14,10],[10,15,11,17],[10,21,10,22],[10,24,14,24],[11,7,11,8],[11,21,11,22],[12,1,12,3],[12,7,12,8],[12,15,12,17],[12,21,12,22],[13,1,14,3],[13,7,13,8],[13,15,14,17],[13,21,13,22],[14,7,14,8],[14,21,14,22],[15,7,15,8],[15,21,15,22],[16,1,16,3],[16,7,16,8],[16,15,16,17],[16,21,16,22],[17,1,18,3],[17,7,17,8],[17,10,21,10],[17,15,18,17],[17,21,17,22],[17,24,21,24],[18,7,18,8],[18,21,18,22],[19,1,19,3],[19,7,19,8],[19,15,19,17],[19,21,19,22],[20,1,21,3],[20,7,20,8],[20,15,21,17],[20,21,20,22],[21,7,21,8],[21,21,21,22],[22,7,22,8],[22,21,22,22],[23,1,23,3],[23,7,23,8],[23,15,23,17],[23,21,23,22],[24,1,25,3],[24,7,24,8],[24,10,28,10],[24,15,25,17],[24,21,24,22],[24,24,28,24],[25,7,25,8],[25,21,25,22],[26,1,26,3],[26,7,26,8],[26,15,26,17],[26,21,26,22],[27,1,28,3],[27,7,27,8],[27,15,28,17],[27,21,27,22],[28,7,28,8],[28,21,28,22],[29,7,29,8],[29,21,29,22],[30,1,30,3],[30,7,30,8],[30,15,30,17],[30,21,30,22],[31,1,32,3],[31,7,31,8],[31,10,35,10],[31,15,32,17],[31,21,31,22],[31,24,35,24],[32,7,32,8],[32,21,32,22],[33,1,33,3],[33,7,33,8],[33,15,33,17],[33,21,33,22],[34,1,35,3],[34,7,34,8],[34,15,35,17],[34,21,34,22],[35,7,35,8],[35,21,35,22],[36,7,36,8],[36,21,36,22],[37,1,37,3],[37,7,37,8],[37,15,37,17],[37,21,37,22],[38,1,39,3],[38,7,38,8],[38,10,42,10],[38,15,39,17],[38,21,38,22],[38,24,42,24],[39,7,39,8],[39,21,39,22],[40,1,40,3],[40,7,40,8],[40,15,40,17],[40,21,40,22],[41,1,42,3],[41,7,41,8],[41,15,42,17],[41,21,41,22],[42,7,42,8],[42,21,42,22],[43,7,43,8],[43,21,43,22],[44,1,44,3],[44,7,44,8],[44,15,44,17],[44,21,44,22],[45,1,46,3],[45,7,45,8],[45,10,49,10],[45,15,46,17],[45,21,45,22],[45,24,49,24],[46,7,46,8],[46,21,46,22],[47,1,47,3],[47,7,47,8],[47,15,47,17],[47,21,47,22],[48,1,49,3],[48,7,48,8],[48,15,49,17],[48,21,48,22],[49,7,49,8],[49,21,49,22],[50,7,50,8],[50,21,50,22],[51,7,51,8],[51,21,51,22],[52,7,52,8],[52,11,52,13],[52,21,52,22],[53,4,53,8],[53,18,53,21],[56,2,56,7],[57,2,57,7],[58,2,58,7],[59,2,59,7],[64,2,64,24],[65,0,65,24],[66,0,66,24],[67,2,67,5],[67,11,67,15],[67,19,67,24],[68,2,68,5],[68,6,68,10],[68,11,68,15],[68,19,68,25]]}
[null,null,null,null,null,null,"Spielleiter: XXXXXX, Tel.: XXXXXX\nE-Mail.: XXXXXXX",null,null,null,null,null,null,null,null,null,null,"Spielbericht"]
[null,null,null,null,"Senioren",null,null,null,null,null,null,null,null,"Land:"]
["Klubspiel",null,null,null,"Frauen",null,null,null,null,null,null,null,null,"Ort:",null,null,null,null,null,null,"Datum:",{"$f":"TODAY()","v":"2020-07-16"}]
["Pokalspiel",null,null,null,"Männer",null,null,null,null,null,null,null,null,"Bahnanlage:"]
["Länderspiel",null,null,null,"U 23",null,null,null,null,null,null,null,null,"Spielbeginn:",null,null,null,null,null,null,"Spielende:"]
[null,null,null,null,"U 18",null,null,null,null,null,null,null,null,"Liga/Klasse:"]
[null,null,null,null,null,null,null,null,null,null,null,"Spiel Nr.",null,null,null,null,null,null,null,null,null,null,null,"Spieltag:"]
[null,null,null,"Heimmannschaft",null,null,null,null,null,null,null,null,null,null,null,null,null,"Gastmannschaft"]
[]
["Pa.-Nr./Mo.Ja","Vorname  Name",null,null,"FW","Abr","Volle","Ges",null,"SP","MP",null,null,null,"Pa.-Nr./Mo.Ja","Vorname  Name",null,null,"FW","Abr","Volle","Ges",null,"SP","MP"]
[null,null,null,null,{"$f":"IF(Einzelergebnisse!A5=0,\"\",Einzelergebnisse!E5)","v":""},{"$f":"IF(Einzelergebnisse!D5=0,\"\",Einzelergebnisse!D5)","v":""},{"$f":"IF(Einzelergebnisse!C5=0,\"\",Einzelergebnisse!C5)","v":""},{"$f":"IF(Einzelergebnisse!F5=0,\"\",Einzelergebnisse!F5)","v":""},null,{"$f":"IF(Einzelergebnisse!$A$5=0,\"\",IF(H11=\"\",0,IF(H11=V11,0.5,IF(H11>V11,1,IF(AND(H11>0,V11=\"\"),1,0)))))","v":""},{"$f":"IF(Einzelergebnisse!A5=0,\"\",IF(H11=\"\",0,IF(J16&H16=X16&V16,0.5,IF(J16&H16>X16&V16,1,IF(J16>X16,1,0)))))","v":""},null,null,null,null,null,null,null,{"$f":"IF(Einzelergebnisse!H5=0,\"\",Einzelergebnisse!L5)","v":""},{"$f":"IF(Einzelergebnisse!K5=0,\"\",Einzelergebnisse!K5)","v":""},{"$f":"IF(Einzelergebnisse!J5=0,\"\",Einzelergebnisse!J5)","v":""},{"$f":"IF(Einzelergebnisse!M5=0,\"\",Einzelergebnisse!M5)","v":""},null,{"$f":"IF(Einzelergebnisse!$H$5=0,\"\",IF(V11=\"\",0,IF(V11=H11,0.5,IF(V11>H11,1,IF(AND(V11>0,H11=\"\"),1,0)))))","v":""},{"$f":"IF(Einzelergebnisse!H5=0,\"\",IF(V11=\"\",0,IF(X16&V16=J16&H16,0.5,IF(X16&V16>J16&H16,1,IF(X16>J16,1,0)))))","v":""}]
[null,null,null,null,{"$f":"IF(Einzelergebnisse!A5=0,\"\",Einzelergebnisse!E6)","v":""},{"$f":"IF(Einzelergebnisse!D6=0,\"\",Einzelergebnisse!D6)","v":""},{"$f":"IF(Einzelergebnisse!C6=0,\"\",Einzelergebnisse!C6)","v":""},{"$f":"IF(Einzelergebnisse!F6=0,\"\",Einzelergebnisse!F6)","v":""},null,{"$f":"IF(Einzelergebnisse!$A$5=0,\"\",IF(H12=\"\",0,IF(H12=V12,0.5,IF(H12>V12,1,IF(AND(H12>0,V12=\"\"),1,0)))))","v":""},null,null,null,null,null,null,null,null,{"$f":"IF(Einzelergebnisse!H5=0,\"\",Einzelergebnisse!L6)","v":""},{"$f":"IF(Einzelergebnisse!K6=0,\"\",Einzelergebnisse!K6)","v":""},{"$f":"IF(Einzelergebnisse!J6=0,\"\",Einzelergebnisse!J6)","v":""},{"$f":"IF(Einzelergebnisse!M6=0,\"\",Einzelergebnisse!M6)","v":""},null,{"$f":"IF(Einzelergebnisse!$H$5=0,\"\",IF(V12=\"\",0,IF(V12=H12,0.5,IF(V12>H12,1,IF(AND(V12>0,H12=\"\"),1,0)))))","v":""}]
["Pa.-Nr./Mo.Ja","Awsp. Vorname, Name",null,null,null,null,null,null,null,null,null,null,null,null,"Pa.-Nr./Mo.Ja","Awsp. Vorname, Name"]
[null,null,null,null,{"$f":"IF(Einzelergebnisse!A5=0,\"\",Einzelergebnisse!E7)","v":""},{"$f":"IF(Einzelergebnisse!D7=0,\"\",Einzelergebnisse!D7)","v":""},{"$f":"IF(Einzelergebnisse!C7=0,\"\",Einzelergebnisse!C7)","v":""},{"$f":"IF(Einzelergebnisse!F7=0,\"\",Einzelergebnisse!F7)","v":""},null,{"$f":"IF(Einzelergebnisse!$A$5=0,\"\",IF(H14=\"\",0,IF(H14=V14,0.5,IF(H14>V14,1,IF(AND(H14>0,V14=\"\"),1,0)))))","v":""},null,null,null,null,null,null,null,null,{"$f":"IF(Einzelergebnisse!H5=0,\"\",Einzelergebnisse!L7)","v":""},{"$f":"IF(Einzelergebnisse!K7=0,\"\",Einzelergebnisse!K7)","v":""},{"$f":"IF(Einzelergebnisse!J7=0,\"\",Einzelergebnisse!J7)","v":""},{"$f":"IF(Einzelergebnisse!M7=0,\"\",Einzelergebnisse!M7)","v":""},null,{"$f":"IF(Einzelergebnisse!$H$5=0,\"\",IF(V14=\"\",0,IF(V14=H14,0.5,IF(V14>H14,1,IF(AND(V14>0,H14=\"\"),1,0)))))","v":""}]
[null,null,null,null,{"$f":"IF(Einzelergebnisse!A5=0,\"\",Einzelergebnisse!E8)","v":""},{"$f":"IF(Einzelergebnisse!D8=0,\"\",Einzelergebnisse!D8)","v":""},{"$f":"IF(Einzelergebnisse!C8=0,\"\",Einzelergebnisse!C8)","v":""},{"$f":"IF(Einzelergebnisse!F8=0,\"\",Einzelergebnisse!F8)","v":""},null,{"$f":"IF(Einzelergebnisse!$A$5=0,\"\",IF(H15=\"\",0,IF(H15=V15,0.5,IF(H15>V15,1,IF(AND(H15>0,V15=\"\"),1,0)))))","v":""},null,null,null,null,null,null,null,null,{"$f":"IF(Einzelergebnisse!H5=0,\"\",Einzelergebnisse!L8)","v":""},{"$f":"IF(Einzelergebnisse!K8=0,\"\",Einzelergebnisse!K8)","v":""},{"$f":"IF(Einzelergebnisse!J8=0,\"\",Einzelergebnisse!J8)","v":""},{"$f":"IF(Einzelergebnisse!M8=0,\"\",Einzelergebnisse!M8)","v":""},null,{"$f":"IF(Einzelergebnisse!$H$5=0,\"\",IF(V15=\"\",0,IF(V15=H15,0.5,IF(V15>H15,1,IF(AND(V15>0,H15=\"\"),1,0)))))","v":""}]
[null,null,null,null,{"$f":"IF(Einzelergebnisse!A5=0,\"\",SUM(E11:E15))","v":""},{"$f":"IF(Einzelergebnisse!A5=0,\"\",SUM(F11:F15))","v":""},{"$f":"IF(Einzelergebnisse!A5=0,\"\",SUM(G11:G15))","v":""},{"$f":"IF(Einzelergebnisse!A5=0,\"\",SUM(H11:H15))","v":""},null,{"$f":"IF(Einzelergebnisse!A5=0,\"\",SUM(J11:J12,J14:J15))","v":""},null,null,null,null,null,null,null,null,{"$f":"IF(Einzelergebnisse!H5=0,\"\",SUM(S11,S12,S14,S15))","v":""},{"$f":"IF(Einzelergebnisse!H5=0,\"\",SUM(T11,T12,T14,T15))","v":""},{"$f":"IF(Einzelergebnisse!H5=0,\"\",SUM(U11,U12,U14,U15))","v":""},{"$f":"IF(Einzelergebnisse!H5=0,\"\",SUM(V11,V12,V14,V15))","v":""},null,{"$f":"IF(Einzelergebnisse!H5=0,\"\",SUM(X11:X12,X14:X15))","v":""}]
["Pa.-Nr./Mo.Ja","Vorname  Name",null,null,"FW","Abr","Volle","Ges",null,"SP","MP",null,null,null,"Pa.-Nr./Mo.Ja","Vorname  Name",null,null,"FW","Abr","Volle","Ges",null,"SP","MP"]
[null,null,null,null,{"$f":"IF(Einzelergebnisse!A13=0,\"\",Einzelergebnisse!E13)","v":""},{"$f":"IF(Einzelergebnisse!D13=0,\"\",Einzelergebnisse!D13)","v":""},{"$f":"IF(Einzelergebnisse!C13=0,\"\",Einzelergebnisse!C13)","v":""},{"$f":"IF(Einzelergebnisse!F13=0,\"\",Einzelergebnisse!F13)","v":""},null,{"$f":"IF(Einzelergebnisse!$A$13=0,\"\",IF(H18=\"\",0,IF(H18=V18,0.5,IF(H18>V18,1,IF(AND(H18>0,V18=\"\"),1,0)))))","v":""},{"$f":"IF(Einzelergebnisse!A13=0,\"\",IF(H18=\"\",0,IF(J23&H23=X23&V23,0.5,IF(J23&H23>X23&V23,1,IF(J23>X23,1,0)))))","v":""},null,null,null,null,null,null,null,{"$f":"IF(Einzelergebnisse!H13=0,\"\",Einzelergebnisse!L13)","v":""},{"$f":"IF(Einzelergebnisse!K13=0,\"\",Einzelergebnisse!K13)","v":""},{"$f":"IF(Einzelergebnisse!J13=0,\"\",Einzelergebnisse!J13)","v":""},{"$f":"IF(Einzelergebnisse!M13=0,\"\",Einzelergebnisse!M13)","v":""},null,{"$f":"IF(Einzelergebnisse!$H$13=0,\"\",IF(V18=\"\",0,IF(V18=H18,0.5,IF(V18>H18,1,IF(AND(V18>0,H18=\"\"),1,0)))))","v":""},{"$f":"IF(Einzelergebnisse!H13=0,\"\",IF(V18=\"\",0,IF(X23&V23=J23&H23,0.5,IF(X23&V23>J23&H23,1,IF(X23>J23,1,0)))))","v":""}]
[null,null,null,null,{"$f":"IF(Einzelergebnisse!A13=0,\"\",Einzelergebnisse!E14)","v":""},{"$f":"IF(Einzelergebnisse!D14=0,\"\",Einzelergebnisse!D14)","v":""},{"$f":"IF(Einzelergebnisse!C14=0,\"\",Einzelergebnisse!C14)","v":""},{"$f":"IF(Einzelergebnisse!F14=0,\"\",Einzelergebnisse!F14)","v":""},null,{"$f":"IF(Einzelergebnisse!$A$13=0,\"\",IF(H19=\"\",0,IF(H19=V19,0.5,IF(H19>V19,1,IF(AND(H19>0,V19=\"\"),1,0)))))","v":""},null,null,null,null,null,null,null,null,{"$f":"IF(Einzelergebnisse!H13=0,\"\",Einzelergebnisse!L14)","v":""},{"$f":"IF(Einzelergebnisse!K14=0,\"\",Einzelergebnisse!K14)","v":""},{"$f":"IF(Einzelergebnisse!J14=0,\"\",Einzelergebnisse!J14)","v":""},{"$f":"IF(Einzelergebnisse!M14=0,\"\",Einzelergebnisse!M14)","v":""},null,{"$f":"IF(Einzelergebnisse!$H$13=0,\"\",IF(V19=\"\",0,IF(V19=H19,0.5,IF(V19>H19,1,IF(AND(V19>0,H19=\"\"),1,0)))))","v":""}]
["Pa.-Nr./Mo.Ja","Awsp. Vorname, Name",null,null,null,null,null,null,null,null,null,null,null,null,"Pa.-Nr./Mo.Ja","Awsp. Vorname, Name"]
[null,null,null,null,{"$f":"IF(Einzelergebnisse!A13=0,\"\",Einzelergebnisse!E15)","v":""},{"$f":"IF(Einzelergebnisse!D15=0,\"\",Einzelergebnisse!D15)","v":""},{"$f":"IF(Einzelergebnisse!C15=0,\"\",Einzelergebnisse!C15)","v":""},{"$f":"IF(Einzelergebnisse!F15=0,\"\",Einzelergebnisse!F15)","v":""},null,{"$f":"IF(Einzelergebnisse!$A$13=0,\"\",IF(H21=\"\",0,IF(H21=V21,0.5,IF(H21>V21,1,IF(AND(H21>0,V21=\"\"),1,0)))))","v":""},null,null,null,null,null,null,null,null,{"$f":"IF(Einzelergebnisse!H13=0,\"\",Einzelergebnisse!L15)","v":""},{"$f":"IF(Einzelergebnisse!K15=0,\"\",Einzelergebnisse!K15)","v":""},{"$f":"IF(Einzelergebnisse!J15=0,\"\",Einzelergebnisse!J15)","v":""},{"$f":"IF(Einzelergebnisse!M15=0,\"\",Einzelergebnisse!M15)","v":""},null,{"$f":"IF(Einzelergebnisse!$H$13=0,\"\",IF(V21=\"\",0,IF(V21=H21,0.5,IF(V21>H21,1,IF(AND(V21>0,H21=\"\"),1,0)))))","v":""}]
[null,null,null,null,{"$f":"IF(Einzelergebnisse!A13=0,\"\",Einzelergebnisse!E16)","v":""},{"$f":"IF(Einzelergebnisse!D16=0,\"\",Einzelergebnisse!D16)","v":""},{"$f":"IF(Einzelergebnisse!C16=0,\"\",Einzelergebnisse!C16)","v":""},{"$f":"IF(Einzelergebnisse!F16=0,\"\",Einzelergebnisse!F16)","v":""},null,{"$f":"IF(Einzelergebnisse!$A$13=0,\"\",IF(H22=\"\",0,IF(H22=V22,0.5,IF(H22>V22,1,IF(AND(H22>0,V22=\"\"),1,0)))))","v":""},null,null,null,null,null,null,null,null,{"$f":"IF(Einzelergebnisse!H13=0,\"\",Einzelergebnisse!L16)","v":""},{"$f":"IF(Einzelergebnisse!K16=0,\"\",Einzelergebnisse!K16)","v":""},{"$f":"IF(Einzelergebnisse!J16=0,\"\",Einzelergebnisse!J16)","v":""},{"$f":"IF(Einzelergebnisse!M16=0,\"\",Einzelergebnisse!M16)","v":""},null,{"$f":"IF(Einzelergebnisse!$H$13=0,\"\",IF(V22=\"\",0,IF(V22=H22,0.5,IF(V22>H22,1,IF(AND(V22>0,H22=\"\"),1,0)))))","v":""}]
[null,null,null,null,{"$f":"IF(Einzelergebnisse!A13=0,\"\",SUM(E18:E22))","v":""},{"$f":"IF(Einzelergebnisse!A13=0,\"\",SUM(F18:F22))","v":""},{"$f":"IF(Einzelergebnisse!A13=0,\"\",SUM(G18:G22))","v":""},{"$f":"IF(Einzelergebnisse!A13=0,\"\",SUM(H18:H22))","v":""},null,{"$f":"IF(Einzelergebnisse!A13=0,\"\",SUM(J18:J19,J21:J22))","v":""},null,null,null,null,null,null,null,null,{"$f":"IF(Einzelergebnisse!H13=0,\"\",SUM(S18,S19,S21,S22))","v":""},{"$f":"IF(Einzelergebnisse!H13=0,\"\",SUM(T18,T19,T21,T22))","v":""},{"$f":"IF(Einzelergebnisse!H13=0,\"\",SUM(U18,U19,U21,U22))","v":""},{"$f":"IF(Einzelergebnisse!H13=0,\"\",SUM(V18,V19,V21,V22))","v":""},null,{"$f":"IF(Einzelergebnisse!H13=0,\"\",SUM(X18:X19,X21:X22))","v":""}]
["Pa.-Nr./Mo.Ja","Vorname  Name",null,null,"FW","Abr","Volle","Ges",null,"SP","MP",null,null,null,"Pa.-Nr./Mo.Ja","Vorname  Name",null,null,"FW","Abr","Volle","Ges",null,"SP","MP"]
[null,null,null,null,{"$f":"IF(Einzelergebnisse!A21=0,\"\",Einzelergebnisse!E21)","v":""},{"$f":"IF(Einzelergebnisse!D21=0,\"\",Einzelergebnisse!D21)","v":""},{"$f":"IF(Einzelergebnisse!C21=0,\"\",Einzelergebnisse!C21)","v":""},{"$f":"IF(Einzelergebnisse!F21=0,\"\",Einzelergebnisse!F21)","v":""},null,{"$f":"IF(Einzelergebnisse!$A$21=0,\"\",IF(H25=\"\",0,IF(H25=V25,0.5,IF(H25>V25,1,IF(AND(H25>0,V25=\"\"),1,0)))))","v":""},{"$f":"IF(Einzelergebnisse!A21=0,\"\",IF(H25=\"\",0,IF(J30&H30=X30&V30,0.5,IF(J30&H30>X30&V30,1,IF(J30>X30,1,0)))))","v":""},null,null,null,null,null,null,null,{"$f":"IF(Einzelergebnisse!H21=0,\"\",Einzelergebnisse!L21)","v":""},{"$f":"IF(Einzelergebnisse!K21=0,\"\",Einzelergebnisse!K21)","v":""},{"$f":"IF(Einzelergebnisse!J21=0,\"\",Einzelergebnisse!J21)","v":""},{"$f":"IF(Einzelergebnisse!M21=0,\"\",Einzelergebnisse!M21)","v":""},null,{"$f":"IF(Einzelergebnisse!$H$21=0,\"\",IF(V25=\"\",0,IF(V25=H25,0.5,IF(V25>H25,1,IF(AND(V25>0,H25=\"\"),1,0)))))","v":""},{"$f":"IF(Einzelergebnisse!H21=0,\"\",IF(V25=\"\",0,IF(X30&V30=J30&H30,0.5,IF(X30&V30>J30&H30,1,IF(X30>J30,1,0)))))","v":""}]
[null,null,null,null,{"$f":"IF(Einzelergebnisse!A21=0,\"\",Einzelergebnisse!E22)","v":""},{"$f":"IF(Einzelergebnisse!D22=0,\"\",Einzelergebnisse!D22)","v":""},{"$f":"IF(Einzelergebnisse!C22=0,\"\",Einzelergebnisse!C22)","v":""},{"$f":"IF(Einzelergebnisse!F22=0,\"\",Einzelergebnisse!F22)","v":""},null,{"$f":"IF(Einzelergebnisse!$A$21=0,\"\",IF(H26=\"\",0,IF(H26=V26,0.5,IF(H26>V26,1,IF(AND(H26>0,V26=\"\"),1,0)))))","v":""},null,null,null,null,null,null,null,null,{"$f":"IF(Einzelergebnisse!H21=0,\"\",Einzelergebnisse!L22)","v":""},{"$f":"IF(Einzelergebnisse!K22=0,\"\",Einzelergebnisse!K22)","v":""},{"$f":"IF(Einzelergebnisse!J22=0,\"\",Einzelergebnisse!J22)","v":""},{"$f":"IF(Einzelergebnisse!M22=0,\"\",Einzelergebnisse!M22)","v":""},null,{"$f":"IF(Einzelergebnisse!$H$21=0,\"\",IF(V26=\"\",0,IF(V26=H26,0.5,IF(V26>H26,1,IF(AND(V26>0,H26=\"\"),1,0)))))","v":""}]
["Pa.-Nr./Mo.Ja","Awsp. Vorname, Name",null,null,null,null,null,null,null,null,null,null,null,null,"Pa.-Nr./Mo.Ja","Awsp. Vorname, Name"]
[null,null,null,null,{"$f":"IF(Einzelergebnisse!A21=0,\"\",Einzelergebnisse!E23)","v":""},{"$f":"IF(Einzelergebnisse!D23=0,\"\",Einzelergebnisse!D23)","v":""},{"$f":"IF(Einzelergebnisse!C23=0,\"\",Einzelergebnisse!C23)","v":""},{"$f":"IF(Einzelergebnisse!F23=0,\"\",Einzelergebnisse!F23)","v":""},null,{"$f":"IF(Einzelergebnisse!$A$21=0,\"\",IF(H28=\"\",0,IF(H28=V28,0.5,IF(H28>V28,1,IF(AND(H28>0,V28=\"\"),1,0)))))","v":""},null,null,null,null,null,null,null,null,{"$f":"IF(Einzelergebnisse!H21=0,\"\",Einzelergebnisse!L23)","v":""},{"$f":"IF(Einzelergebnisse!K23=0,\"\",Einzelergebnisse!K23)","v":""},{"$f":"IF(Einzelergebnisse!J23=0,\"\",Einzelergebnisse!J23)","v":""},{"$f":"IF(Einzelergebnisse!M23=0,\"\",Einzelergebnisse!M23)","v":""},null,{"$f":"IF(Einzelergebnisse!$H$21=0,\"\",IF(V28=\"\",0,IF(V28=H28,0.5,IF(V28>H28,1,IF(AND(V28>0,H28=\"\"),1,0)))))","v":""}]
[null,null,null,null,{"$f":"IF(Einzelergebnisse!A21=0,\"\",Einzelergebnisse!E24)","v":""},{"$f":"IF(Einzelergebnisse!D24=0,\"\",Einzelergebnisse!D24)","v":""},{"$f":"IF(Einzelergebnisse!C24=0,\"\",Einzelergebnisse!C24)","v":""},{"$f":"IF(Einzelergebnisse!F24=0,\"\",Einzelergebnisse!F24)","v":""},null,{"$f":"IF(Einzelergebnisse!$A$21=0,\"\",IF(H29=\"\",0,IF(H29=V29,0.5,IF(H29>V29,1,IF(AND(H29>0,V29=\"\"),1,0)))))","v":""},null,null,null,null,null,null,null,null,{"$f":"IF(Einzelergebnisse!H21=0,\"\",Einzelergebnisse!L24)","v":""},{"$f":"IF(Einzelergebnisse!K24=0,\"\",Einzelergebnisse!K24)","v":""},{"$f":"IF(Einzelergebnisse!J24=0,\"\",Einzelergebnisse!J24)","v":""},{"$f":"IF(Einzelergebnisse!M24=0,\"\",Einzelergebnisse!M24)","v":""},null,{"$f":"IF(Einzelergebnisse!$H$21=0,\"\",IF(V29=\"\",0,IF(V29=H29,0.5,IF(V29>H29,1,IF(AND(V29>0,H29=\"\"),1,0)))))","v":""}]
[null,null,null,null,{"$f":"IF(Einzelergebnisse!A21=0,\"\",SUM(E25:E29))","v":""},{"$f":"IF(Einzelergebnisse!A21=0,\"\",SUM(F25:F29))","v":""},{"$f":"IF(Einzelergebnisse!A21=0,\"\",SUM(G25:G29))","v":""},{"$f":"IF(Einzelergebnisse!A21=0,\"\",SUM(H25:H29))","v":""},null,{"$f":"IF(Einzelergebnisse!A21=0,\"\",SUM(J25:J26,J28:J29))","v":""},null,null,null,null,null,null,null,null,{"$f":"IF(Einzelergebnisse!H21=0,\"\",SUM(S25,S26,S28,S29))","v":""},{"$f":"IF(Einzelergebnisse!H21=0,\"\",SUM(T25,T26,T28,T29))","v":""},{"$f":"IF(Einzelergebnisse!H21=0,\"\",SUM(U25,U26,U28,U29))","v":""},{"$f":"IF(Einzelergebnisse!H21=0,\"\",SUM(V25,V26,V28,V29))","v":""},null,{"$f":"IF(Einzelergebnisse!H21=0,\"\",SUM(X25:X26,X28:X29))","v":""}]
["Pa.-Nr./Mo.Ja","Vorname  Name",null,null,"FW","Abr","Volle","Ges",null,"SP","MP",null,null,null,"Pa.-Nr./Mo.Ja","Vorname  Name",null,null,"FW","Abr","Volle","Ges",null,"Sp","MP"]
[null,null,null,null,{"$f":"IF(Einzelergebnisse!A29=0,\"\",Einzelergebnisse!E29)","v":""},{"$f":"IF(Einzelergebnisse!D29=0,\"\",Einzelergebnisse!D29)","v":""},{"$f":"IF(Einzelergebnisse!C29=0,\"\",Einzelergebnisse!C29)","v":""},{"$f":"IF(Einzelergebnisse!F29=0,\"\",Einzelergebnisse!F29)","v":""},null,{"$f":"IF(Einzelergebnisse!$A$29=0,\"\",IF(H32=\"\",0,IF(H32=V32,0.5,IF(H32>V32,1,IF(AND(H32>0,V32=\"\"),1,0)))))","v":""},{"$f":"IF(Einzelergebnisse!A29=0,\"\",IF(H32=\"\",0,IF(J37&H37=X37&V37,0.5,IF(J37&H37>X37&V37,1,IF(J37>X37,1,0)))))","v":""},null,null,null,null,null,null,null,{"$f":"IF(Einzelergebnisse!H29=0,\"\",Einzelergebnisse!L29)","v":""},{"$f":"IF(Einzelergebnisse!K29=0,\"\",Einzelergebnisse!K29)","v":""},{"$f":"IF(Einzelergebnisse!J29=0,\"\",Einzelergebnisse!J29)","v":""},{"$f":"IF(Einzelergebnisse!M29=0,\"\",Einzelergebnisse!M29)","v":""},null,{"$f":"IF(Einzelergebnisse!$H$29=0,\"\",IF(V32=\"\",0,IF(V32=H32,0.5,IF(V32>H32,1,IF(AND(V32>0,H32=\"\"),1,0)))))","v":""},{"$f":"IF(Einzelergebnisse!H29=0,\"\",IF(V32=\"\",0,IF(X37&V37=J37&H37,0.5,IF(X37&V37>J37&H37,1,IF(X37>J37,1,0)))))","v":""}]
[null,null,null,null,{"$f":"IF(Einzelergebnisse!A29=0,\"\",Einzelergebnisse!E30)","v":""},{"$f":"IF(Einzelergebnisse!D30=0,\"\",Einzelergebnisse!D30)","v":""},{"$f":"IF(Einzelergebnisse!C30=0,\"\",Einzelergebnisse!C30)","v":""},{"$f":"IF(Einzelergebnisse!F30=0,\"\",Einzelergebnisse!F30)","v":""},null,{"$f":"IF(Einzelergebnisse!$A$29=0,\"\",IF(H33=\"\",0,IF(H33=V33,0.5,IF(H33>V33,1,IF(AND(H33>0,V33=\"\"),1,0)))))","v":""},null,null,null,null,null,null,null,null,{"$f":"IF(Einzelergebnisse!H29=0,\"\",Einzelergebnisse!L30)","v":""},{"$f":"IF(Einzelergebnisse!K30=0,\"\",Einzelergebnisse!K30)","v":""},{"$f":"IF(Einzelergebnisse!J30=0,\"\",Einzelergebnisse!J30)","v":""},{"$f":"IF(Einzelergebnisse!M30=0,\"\",Einzelergebnisse!M30)","v":""},null,{"$f":"IF(Einzelergebnisse!$H$29=0,\"\",IF(V33=\"\",0,IF(V33=H33,0.5,IF(V33>H33,1,IF(AND(V33>0,H33=\"\"),1,0)))))","v":""}]
["Pa.-Nr./Mo.Ja","Awsp. Vorname, Name",null,null,null,null,null,null,null,null,null,null,null,null,"Pa.-Nr./Mo.Ja","Awsp. Vorname, Name"]
[null,null,null,null,{"$f":"IF(Einzelergebnisse!A29=0,\"\",Einzelergebnisse!E31)","v":""},{"$f":"IF(Einzelergebnisse!D31=0,\"\",Einzelergebnisse!D31)","v":""},{"$f":"IF(Einzelergebnisse!C31=0,\"\",Einzelergebnisse!C31)","v":""},{"$f":"IF(Einzelergebnisse!F31=0,\"\",Einzelergebnisse!F31)","v":""},null,{"$f":"IF(Einzelergebnisse!$A$29=0,\"\",IF(H35=\"\",0,IF(H35=V35,0.5,IF(H35>V35,1,IF(AND(H35>0,V35=\"\"),1,0)))))","v":""},null,null,null,null,null,null,null,null,{"$f":"IF(Einzelergebnisse!H29=0,\"\",Einzelergebnisse!L31)","v":""},{"$f":"IF(Einzelergebnisse!K31=0,\"\",Einzelergebnisse!K31)","v":""},{"$f":"IF(Einzelergebnisse!J31=0,\"\",Einzelergebnisse!J31)","v":""},{"$f":"IF(Einzelergebnisse!M31=0,\"\",Einzelergebnisse!M31)","v":""},null,{"$f":"IF(Einzelergebnisse!$H$29=0,\"\",IF(V35=\"\",0,IF(V35=H35,0.5,IF(V35>H35,1,IF(AND(V35>0,H35=\"\"),1,0)))))","v":""}]
[null,null,null,null,{"$f":"IF(Einzelergebnisse!A29=0,\"\",Einzelergebnisse!E32)","v":""},{"$f":"IF(Einzelergebnisse!D32=0,\"\",Einzelergebnisse!D32)","v":""},{"$f":"IF(Einzelergebnisse!C32=0,\"\",Einzelergebnisse!C32)","v":""},{"$f":"IF(Einzelergebnisse!F32=0,\"\",Einzelergebnisse!F32)","v":""},null,{"$f":"IF(Einzelergebnisse!$A$29=0,\"\",IF(H36=\"\",0,IF(H36=V36,0.5,IF(H36>V36,1,IF(AND(H36>0,V36=\"\"),1,0)))))","v":""},null,null,null,null,null,null,null,null,{"$f":"IF(Einzelergebnisse!H29=0,\"\",Einzelergebnisse!L32)","v":""},{"$f":"IF(Einzelergebnisse!K32=0,\"\",Einzelergebnisse!K32)","v":""},{"$f":"IF(Einzelergebnisse!J32=0,\"\",Einzelergebnisse!J32)","v":""},{"$f":"IF(Einzelergebnisse!M32=0,\"\",Einzelergebnisse!M32)","v":""},null,{"$f":"IF(Einzelergebnisse!$H$29=0,\"\",IF(V36=\"\",0,IF(V36=H36,0.5,IF(V36>H36,1,IF(AND(V36>0,H36=\"\"),1,0)))))","v":""}]
[null,null,null,null,{"$f":"IF(Einzelergebnisse!A29=0,\"\",SUM(E32:E36))","v":""},{"$f":"IF(Einzelergebnisse!A29=0,\"\",SUM(F32:F36))","v":""},{"$f":"IF(Einzelergebnisse!A29=0,\"\",SUM(G32:G36))","v":""},{"$f":"IF(Einzelergebnisse!A29=0,\"\",SUM(H32:H36))","v":""},null,{"$f":"IF(Einzelergebnisse!A29=0,\"\",SUM(J32:J33,J35:J36))","v":""},null,null,null,null,null,null,null,null,{"$f":"IF(Einzelergebnisse!H29=0,\"\",SUM(S32,S33,S35,S36))","v":""},{"$f":"IF(Einzelergebnisse!H29=0,\"\",SUM(T32,T33,T35,T36))","v":""},{"$f":"IF(Einzelergebnisse!H29=0,\"\",SUM(U32,U33,U35,U36))","v":""},{"$f":"IF(Einzelergebnisse!H29=0,\"\",SUM(V32,V33,V35,V36))","v":""},null,{"$f":"IF(Einzelergebnisse!H29=0,\"\",SUM(X32:X33,X35:X36))","v":""}]
["Pa.-Nr./Mo.Ja","Vorname  Name",null,null,"FW","Abr","Volle","Ges",null,"SP","MP",null,null,null,"Pa.-Nr./Mo.Ja","Vorname  Name",null,null,"FW","Abr","Volle","Ges",null,"SP","MP"]
[null,null,null,null,{"$f":"IF(Einzelergebnisse!A37=0,\"\",Einzelergebnisse!E37)","v":""},{"$f":"IF(Einzelergebnisse!D37=0,\"\",Einzelergebnisse!D37)","v":""},{"$f":"IF(Einzelergebnisse!C37=0,\"\",Einzelergebnisse!C37)","v":""},{"$f":"IF(Einzelergebnisse!F37=0,\"\",Einzelergebnisse!F37)","v":""},null,{"$f":"IF(Einzelergebnisse!$A$37=0,\"\",IF(H39=\"\",0,IF(H39=V39,0.5,IF(H39>V39,1,IF(AND(H39>0,V39=\"\"),1,0)))))","v":""},{"$f":"IF(Einzelergebnisse!A37=0,\"\",IF(H39=\"\",0,IF(J44&H44=X44&V44,0.5,IF(J44&H44>X44&V44,1,IF(J44>X44,1,0)))))","v":""},null,null,null,null,null,null,null,{"$f":"IF(Einzelergebnisse!H37=0,\"\",Einzelergebnisse!L37)","v":""},{"$f":"IF(Einzelergebnisse!K37=0,\"\",Einzelergebnisse!K37)","v":""},{"$f":"IF(Einzelergebnisse!J37=0,\"\",Einzelergebnisse!J37)","v":""},{"$f":"IF(Einzelergebnisse!M37=0,\"\",Einzelergebnisse!M37)","v":""},null,{"$f":"IF(Einzelergebnisse!$H$37=0,\"\",IF(V39=\"\",0,IF(V39=H39,0.5,IF(V39>H39,1,IF(AND(V39>0,H39=\"\"),1,0)))))","v":""},{"$f":"IF(Einzelergebnisse!H37=0,\"\",IF(V39=\"\",0,IF(X44&V44=J44&H44,0.5,IF(X44&V44>J44&H44,1,IF(X44>J44,1,0)))))","v":""}]
[null,null,null,null,{"$f":"IF(Einzelergebnisse!A37=0,\"\",Einzelergebnisse!E38)","v":""},{"$f":"IF(Einzelergebnisse!D38=0,\"\",Einzelergebnisse!D38)","v":""},{"$f":"IF(Einzelergebnisse!C38=0,\"\",Einzelergebnisse!C38)","v":""},{"$f":"IF(Einzelergebnisse!F38=0,\"\",Einzelergebnisse!F38)","v":""},null,{"$f":"IF(Einzelergebnisse!$A$37=0,\"\",IF(H40=\"\",0,IF(H40=V40,0.5,IF(H40>V40,1,IF(AND(H40>0,V40=\"\"),1,0)))))","v":""},null,null,null,null,null,null,null,null,{"$f":"IF(Einzelergebnisse!H37=0,\"\",Einzelergebnisse!L38)","v":""},{"$f":"IF(Einzelergebnisse!K38=0,\"\",Einzelergebnisse!K38)","v":""},{"$f":"IF(Einzelergebnisse!J38=0,\"\",Einzelergebnisse!J38)","v":""},{"$f":"IF(Einzelergebnisse!M38=0,\"\",Einzelergebnisse!M38)","v":""},null,{"$f":"IF(Einzelergebnisse!$H$37=0,\"\",IF(V40=\"\",0,IF(V40=H40,0.5,IF(V40>H40,1,IF(AND(V40>0,H40=\"\"),1,0)))))","v":""}]
["Pa.-Nr./Mo.Ja","Awsp. Vorname, Name",null,null,null,null,null,null,null,null,null,null,null,null,"Pa.-Nr./Mo.Ja","Awsp. Vorname, Name"]
[null,null,null,null,{"$f":"IF(Einzelergebnisse!A37=0,\"\",Einzelergebnisse!E39)","v":""},{"$f":"IF(Einzelergebnisse!D39=0,\"\",Einzelergebnisse!D39)","v":""},{"$f":"IF(Einzelergebnisse!C39=0,\"\",Einzelergebnisse!C39)","v":""},{"$f":"IF(Einzelergebnisse!F39=0,\"\",Einzelergebnisse!F39)","v":""},null,{"$f":"IF(Einzelergebnisse!$A$37=0,\"\",IF(H42=\"\",0,IF(H42=V42,0.5,IF(H42>V42,1,IF(AND(H42>0,V42=\"\"),1,0)))))","v":""},null,null,null,null,null,null,null,null,{"$f":"IF(Einzelergebnisse!H37=0,\"\",Einzelergebnisse!L39)","v":""},{"$f":"IF(Einzelergebnisse!K39=0,\"\",Einzelergebnisse!K39)","v":""},{"$f":"IF(Einzelergebnisse!J39=0,\"\",Einzelergebnisse!J39)","v":""},{"$f":"IF(Einzelergebnisse!M39=0,\"\",Einzelergebnisse!M39)","v":""},null,{"$f":"IF(Einzelergebnisse!$H$37=0,\"\",IF(V42=\"\",0,IF(V42=H42,0.5,IF(V42>H42,1,IF(AND(V42>0,H42=\"\"),1,0)))))","v":""}]
[null,null,null,null,{"$f":"IF(Einzelergebnisse!A37=0,\"\",Einzelergebnisse!E40)","v":""},{"$f":"IF(Einzelergebnisse!D40=0,\"\",Einzelergebnisse!D40)","v":""},{"$f":"IF(Einzelergebnisse!C40=0,\"\",Einzelergebnisse!C40)","v":""},{"$f":"IF(Einzelergebnisse!F40=0,\"\",Einzelergebnisse!F40)","v":""},null,{"$f":"IF(Einzelergebnisse!$A$37=0,\"\",IF(H43=\"\",0,IF(H43=V43,0.5,IF(H43>V43,1,IF(AND(H43>0,V43=\"\"),1,0)))))","v":""},null,null,null,null,null,null,null,null,{"$f":"IF(Einzelergebnisse!H37=0,\"\",Einzelergebnisse!L40)","v":""},{"$f":"IF(Einzelergebnisse!K40=0,\"\",Einzelergebnisse!K40)","v":""},{"$f":"IF(Einzelergebnisse!J40=0,\"\",Einzelergebnisse!J40)","v":""},{"$f":"IF(Einzelergebnisse!M40=0,\"\",Einzelergebnisse!M40)","v":""},null,{"$f":"IF(Einzelergebnisse!$H$37=0,\"\",IF(V43=\"\",0,IF(V43=H43,0.5,IF(V43>H43,1,IF(AND(V43>0,H43=\"\"),1,0)))))","v":""}]
[null,null,null,null,{"$f":"IF(Einzelergebnisse!A37=0,\"\",SUM(E39:E43))","v":""},{"$f":"IF(Einzelergebnisse!A37=0,\"\",SUM(F39:F43))","v":""},{"$f":"IF(Einzelergebnisse!A37=0,\"\",SUM(G39:G43))","v":""},{"$f":"IF(Einzelergebnisse!A37=0,\"\",SUM(H39:H43))","v":""},null,{"$f":"IF(Einzelergebnisse!A37=0,\"\",SUM(J39:J40,J42:J43))","v":""},null,null,null,null,null,null,null,null,{"$f":"IF(Einzelergebnisse!H37=0,\"\",SUM(S39,S40,S42,S43))","v":""},{"$f":"IF(Einzelergebnisse!H37=0,\"\",SUM(T39,T40,T42,T43))","v":""},{"$f":"IF(Einzelergebnisse!H37=0,\"\",SUM(U39,U40,U42,U43))","v":""},{"$f":"IF(Einzelergebnisse!H37=0,\"\",SUM(V39,V40,V42,V43))","v":""},null,{"$f":"IF(Einzelergebnisse!H37=0,\"\",SUM(X39:X40,X42:X43))","v":""}]
["Pa.-Nr./Mo.Ja","Vorname  Name",null,null,"FW","Abr","Volle","Ges",null,"SP","MP",null,null,null,"Pa.-Nr./Mo.Ja","Vorname  Name",null,null,"FW","Abr","Volle","Ges",null,"SP","MP"]
[null,null,null,null,{"$f":"IF(Einzelergebnisse!A45=0,\"\",Einzelergebnisse!E45)","v":""},{"$f":"IF(Einzelergebnisse!D45=0,\"\",Einzelergebnisse!D45)","v":""},{"$f":"IF(Einzelergebnisse!C45=0,\"\",Einzelergebnisse!C45)","v":""},{"$f":"IF(Einzelergebnisse!F45=0,\"\",Einzelergebnisse!F45)","v":""},null,{"$f":"IF(Einzelergebnisse!$A$45=0,\"\",IF(H46=\"\",0,IF(H46=V46,0.5,IF(H46>V46,1,IF(AND(H46>0,V46=\"\"),1,0)))))","v":""},{"$f":"IF(Einzelergebnisse!A45=0,\"\",IF(H46=\"\",0,IF(J51&H51=X51&V51,0.5,IF(J51&H51>X51&V51,1,IF(J51>X51,1,0)))))","v":""},null,null,null,null,null,null,null,{"$f":"IF(Einzelergebnisse!H45=0,\"\",Einzelergebnisse!L45)","v":""},{"$f":"IF(Einzelergebnisse!K45=0,\"\",Einzelergebnisse!K45)","v":""},{"$f":"IF(Einzelergebnisse!J45=0,\"\",Einzelergebnisse!J45)","v":""},{"$f":"IF(Einzelergebnisse!M45=0,\"\",Einzelergebnisse!M45)","v":""},null,{"$f":"IF(Einzelergebnisse!$H$45=0,\"\",IF(V46=\"\",0,IF(V46=H46,0.5,IF(V46>H46,1,IF(AND(V46>0,H46=\"\"),1,0)))))","v":""},{"$f":"IF(Einzelergebnisse!H45=0,\"\",IF(V46=\"\",0,IF(X51&V51=J51&H51,0.5,IF(X51&V51>J51&H51,1,IF(X51>J51,1,0)))))","v":""}]
[null,null,null,null,{"$f":"IF(Einzelergebnisse!A45=0,\"\",Einzelergebnisse!E46)","v":""},{"$f":"IF(Einzelergebnisse!D46=0,\"\",Einzelergebnisse!D46)","v":""},{"$f":"IF(Einzelergebnisse!C46=0,\"\",Einzelergebnisse!C46)","v":""},{"$f":"IF(Einzelergebnisse!F46=0,\"\",Einzelergebnisse!F46)","v":""},null,{"$f":"IF(Einzelergebnisse!$A$45=0,\"\",IF(H47=\"\",0,IF(H47=V47,0.5,IF(H47>V47,1,IF(AND(H47>0,V47=\"\"),1,0)))))","v":""},null,null,null,null,null,null,null,null,{"$f":"IF(Einzelergebnisse!H45=0,\"\",Einzelergebnisse!L46)","v":""},{"$f":"IF(Einzelergebnisse!K46=0,\"\",Einzelergebnisse!K46)","v":""},{"$f":"IF(Einzelergebnisse!J46=0,\"\",Einzelergebnisse!J46)","v":""},{"$f":"IF(Einzelergebnisse!M46=0,\"\",Einzelergebnisse!M46)","v":""},null,{"$f":"IF(Einzelergebnisse!$H$45=0,\"\",IF(V47=\"\",0,IF(V47=H47,0.5,IF(V47>H47,1,IF(AND(V47>0,H47=\"\"),1,0)))))","v":""}]
["Pa.-Nr./Mo.Ja","Awsp. Vorname, Name",null,null,null,null,null,null,null,null,null,null,null,null,"Pa.-Nr./Mo.Ja","Awsp. Vorname, Name"]
[null,null,null,null,{"$f":"IF(Einzelergebnisse!A45=0,\"\",Einzelergebnisse!E47)","v":""},{"$f":"IF(Einzelergebnisse!D47=0,\"\",Einzelergebnisse!D47)","v":""},{"$f":"IF(Einzelergebnisse!C47=0,\"\",Einzelergebnisse!C47)","v":""},{"$f":"IF(Einzelergebnisse!F47=0,\"\",Einzelergebnisse!F47)","v":""},null,{"$f":"IF(Einzelergebnisse!$A$45=0,\"\",IF(H49=\"\",0,IF(H49=V49,0.5,IF(H49>V49,1,IF(AND(H49>0,V49=\"\"),1,0)))))","v":""},null,null,null,null,null,null,null,null,{"$f":"IF(Einzelergebnisse!H45=0,\"\",Einzelergebnisse!L47)","v":""},{"$f":"IF(Einzelergebnisse!K47=0,\"\",Einzelergebnisse!K47)","v":""},{"$f":"IF(Einzelergebnisse!J47=0,\"\",Einzelergebnisse!J47)","v":""},{"$f":"IF(Einzelergebnisse!M47=0,\"\",Einzelergebnisse!M47)","v":""},null,{"$f":"IF(Einzelergebnisse!$H$45=0,\"\",IF(V49=\"\",0,IF(V49=H49,0.5,IF(V49>H49,1,IF(AND(V49>0,H49=\"\"),1,0)))))","v":""}]
[null,null,null,null,{"$f":"IF(Einzelergebnisse!A45=0,\"\",Einzelergebnisse!E48)","v":""},{"$f":"IF(Einzelergebnisse!D48=0,\"\",Einzelergebnisse!D48)","v":""},{"$f":"IF(Einzelergebnisse!C48=0,\"\",Einzelergebnisse!C48)","v":""},{"$f":"IF(Einzelergebnisse!F48=0,\"\",Einzelergebnisse!F48)","v":""},null,{"$f":"IF(Einzelergebnisse!$A$45=0,\"\",IF(H50=\"\",0,IF(H50=V50,0.5,IF(H50>V50,1,IF(AND(H50>0,V50=\"\"),1,0)))))","v":""},null,null,null,null,null,null,null,null,{"$f":"IF(Einzelergebnisse!H45=0,\"\",Einzelergebnisse!L48)","v":""},{"$f":"IF(Einzelergebnisse!K48=0,\"\",Einzelergebnisse!K48)","v":""},{"$f":"IF(Einzelergebnisse!J48=0,\"\",Einzelergebnisse!J48)","v":""},{"$f":"IF(Einzelergebnisse!M48=0,\"\",Einzelergebnisse!M48)","v":""},null,{"$f":"IF(Einzelergebnisse!$H$45=0,\"\",IF(V50=\"\",0,IF(V50=H50,0.5,IF(V50>H50,1,IF(AND(V50>0,H50=\"\"),1,0)))))","v":""}]
[null,null,null,null,{"$f":"IF(Einzelergebnisse!A45=0,\"\",SUM(E46:E50))","v":""},{"$f":"IF(Einzelergebnisse!A45=0,\"\",SUM(F46:F50))","v":""},{"$f":"IF(Einzelergebnisse!A45=0,\"\",SUM(G46:G50))","v":""},{"$f":"IF(Einzelergebnisse!A45=0,\"\",SUM(H46:H50))","v":""},null,{"$f":"IF(Einzelergebnisse!A45=0,\"\",SUM(J46:J47,J49:J50))","v":""},null,null,null,null,null,null,null,null,{"$f":"IF(Einzelergebnisse!H45=0,\"\",SUM(S46,S47,S49,S50))","v":""},{"$f":"IF(Einzelergebnisse!H45=0,\"\",SUM(T46,T47,T49,T50))","v":""},{"$f":"IF(Einzelergebnisse!H45=0,\"\",SUM(U46,U47,U49,U50))","v":""},{"$f":"IF(Einzelergebnisse!H45=0,\"\",SUM(V46,V47,V49,V50))","v":""},null,{"$f":"IF(Einzelergebnisse!H45=0,\"\",SUM(X46:X47,X49:X50))","v":""}]
[null,null,null,null,"gF","gA","gV","gK",null,"SP","MP",null,null,null,null,null,null,null,"gF","gA","gV","gK",null,"SP","MP"]
[null,null,null,null,{"$f":"IF(Einzelergebnisse!A5=0,\"\",SUM(E16,E23,E30,E37,E44,E51))","v":""},{"$f":"IF(Einzelergebnisse!A5=0,\"\",SUM(F16,F23,F30,F37,F44,F51))","v":""},{"$f":"IF(Einzelergebnisse!A5=0,\"\",SUM(G16,G23,G30,G37,G44,G51))","v":""},{"$f":"IF(Einzelergebnisse!A5=0,\"\",SUM(H16,H23,H30,H37,H44,H51))","v":""},null,{"$f":"IF(Einzelergebnisse!A5=0,\"\",SUM(J16,J23,J30,J37,J44,J51))","v":""},{"$f":"IF(Einzelergebnisse!A5=0,\"\",SUM(K11,K18,K25,K32,K39,K46))","v":""},"Endstand",null,null,null,null,null,null,{"$f":"IF(Einzelergebnisse!H5=0,\"\",SUM(S16,S23,S30,S37,S44,S51))","v":""},{"$f":"IF(Einzelergebnisse!H5=0,\"\",SUM(T16,T23,T30,T37,T44,T51))","v":""},{"$f":"IF(Einzelergebnisse!H5=0,\"\",SUM(U16,U23,U30,U37,U44,U51))","v":""},{"$f":"IF(Einzelergebnisse!H5=0,\"\",SUM(V16,V23,V30,V37,V44,V51))","v":""},null,{"$f":"IF(Einzelergebnisse!H5=0,\"\",SUM(X16,X23,X30,X37,X44,X51))","v":""},{"$f":"IF(Einzelergebnisse!H5=0,\"\",SUM(Y11,Y18,Y25,Y32,Y39,Y46))","v":""}]
[null,null,"Gesamt Kegel",{"$f":"IF(Einzelergebnisse!A5=0,\"\",SUM(H16,H23,H30,H37,H44,H51))","v":""},"Kegel Punkte",null,null,null,null,{"$f":"IF(Einzelergebnisse!A5=0,\"\",IF(D54=0,0,IF(D54=R54,1,IF(D54>R54,2,0))))","v":""},null,{"$f":"IF(Einzelergebnisse!A5=0,\"\",SUM(K53,J54))","v":""},":",{"$f":"IF(Einzelergebnisse!H5=0,\"\",SUM(X54,Y53))","v":""},null,null,"Gesamt Kegel",{"$f":"IF(Einzelergebnisse!H5=0,\"\",SUM(V16,V23,V30,V37,V44,V51))","v":""},"Kegel Punkte",null,null,null,null,{"$f":"IF(Einzelergebnisse!H5=0,\"\",IF(R54=0,0,IF(R54=D54,1,IF(R54>D54,2,0))))","v":""}]
[null,null,null,null,null,null,null,null,null,null,"Tabellenpunkte",{"$f":"IF(Einzelergebnisse!A5=0,\"\",IF(L54=0,0,IF(L54=N54,1,IF(L54>N54,2,0))))","v":""},":",{"$f":"IF(Einzelergebnisse!A5=0,\"\",IF(N54=0,0,IF(N54=L54,1,IF(N54>L54,2,0))))","v":""}]
[]
[null,"   1)","Bahn/Kugelmaterial in Ordnung",null,null,null,null,null,null,"ja",null,"nein",null,null,null,null,null,"5)",null,null,"Verwarnung",null,"ja",null,"nein"]
[null,"   2)","Pässe in Ordnung",null,null,null,null,null,null,"ja",null,"nein",null,null,null,null,null,"6)",null,null,"Sonstiges",null,"ja",null,"nein"]
[null,"   3)","Protest",null,null,null,null,null,null,"ja",null,"nein"]
[null,"4)","Verletzung",null,null,null,null,null,null,"ja",null,"nein"]
[]
[]
[]
[]
[null,"Bemerkung zu"]
[]
[]
[null,"Heimmannschaft",null,null,null,null,null,null,null,null,null,null,null,null,null,null,null,null,"Gastmannschaft"]

{"sheet":"Einzelergebnisse","index":1,"n_rows":53,"n_cols":13,"rows_kept":53,"cut":false,"hidden":false,"merged":[[1,0,1,5],[1,7,1,12]]}
[]
[{"$f":"\"Heimmannschaft:     \"&DKB!D8","v":"Heimmannschaft:     Heimmannschaft"},null,null,null,null,null,null,{"$f":"\"Gastmannschaft:     \"&DKB!R8","v":"Gastmannschaft:     Gastmannschaft"}]
[]
["Name","DG","Volle","Abr","Fe","Ges",null,"Name","DG","Volle","Abr","Fe","Ges"]
[{"$f":"DKB!B11","v":0},1,null,{"$f":"SUM(F5-C5)","v":0},null,null,null,{"$f":"DKB!P11","v":0},1,null,{"$f":"SUM(M5-J5)","v":0}]
[null,2,null,{"$f":"SUM(F6-C6)","v":0},null,null,null,null,2,null,{"$f":"SUM(M6-J6)","v":0}]
[{"$f":"DKB!B14","v":0},3,null,{"$f":"SUM(F7-C7)","v":0},null,null,null,{"$f":"DKB!P14","v":0},3,null,{"$f":"SUM(M7-J7)","v":0}]
[null,4,null,{"$f":"SUM(F8-C8)","v":0},null,null,null,null,4,null,{"$f":"SUM(M8-J8)","v":0}]
[null,null,{"$f":"SUM(C5:C8)","v":0},{"$f":"SUM(D5:D8)","v":0},{"$f":"SUM(E5:E8)","v":0},{"$f":"SUM(F5:F8)","v":0},null,null,null,{"$f":"SUM(J5:J8)","v":0},{"$f":"SUM(K5:K8)","v":0},{"$f":"SUM(L5:L8)","v":0},{"$f":"SUM(M5:M8)","v":0}]
[]
[]
["Name","DG","Volle","Abr","Fe","Ges",null,"Name","DG","Volle","Abr","Fe","Ges"]
[{"$f":"DKB!B18","v":0},1,null,{"$f":"SUM(F13-C13)","v":0},null,null,null,{"$f":"DKB!P18","v":0},1,null,{"$f":"SUM(M13-J13)","v":0}]
[null,2,null,{"$f":"SUM(F14-C14)","v":0},null,null,null,null,2,null,{"$f":"SUM(M14-J14)","v":0}]
[{"$f":"DKB!B21","v":0},3,null,{"$f":"SUM(F15-C15)","v":0},null,null,null,{"$f":"DKB!P21","v":0},3,null,{"$f":"SUM(M15-J15)","v":0}]
[null,4,null,{"$f":"SUM(F16-C16)","v":0},null,null,null,null,4,null,{"$f":"SUM(M16-J16)","v":0}]
[null,null,{"$f":"SUM(C13:C16)","v":0},{"$f":"SUM(D13:D16)","v":0},{"$f":"SUM(E13:E16)","v":0},{"$f":"SUM(F13:F16)","v":0},null,null,null,{"$f":"SUM(J13:J16)","v":0},{"$f":"SUM(K13:K16)","v":0},{"$f":"SUM(L13:L16)","v":0},{"$f":"SUM(M13:M16)","v":0}]
[]
[]
["Name","DG","Volle","Abr","Fe","Ges",null,"Name","DG","Volle","Abr","Fe","Ges"]
[{"$f":"DKB!B25","v":0},1,null,{"$f":"SUM(F21-C21)","v":0},null,null,null,{"$f":"DKB!P25","v":0},1,null,{"$f":"SUM(M21-J21)","v":0}]
[null,2,null,{"$f":"SUM(F22-C22)","v":0},null,null,null,null,2,null,{"$f":"SUM(M22-J22)","v":0}]
[{"$f":"DKB!B28","v":0},3,null,{"$f":"SUM(F23-C23)","v":0},null,null,null,{"$f":"DKB!P28","v":0},3,null,{"$f":"SUM(M23-J23)","v":0}]
[null,4,null,{"$f":"SUM(F24-C24)","v":0},null,null,null,null,4,null,{"$f":"SUM(M24-J24)","v":0}]
[null,null,{"$f":"SUM(C21:C24)","v":0},{"$f":"SUM(D21:D24)","v":0},{"$f":"SUM(E21:E24)","v":0},{"$f":"SUM(F21:F24)","v":0},null,null,null,{"$f":"SUM(J21:J24)","v":0},{"$f":"SUM(K21:K24)","v":0},{"$f":"SUM(L21:L24)","v":0},{"$f":"SUM(M21:M24)","v":0}]
[]
[]
["Name","DG","Volle","Abr","Fe","Ges",null,"Name","DG","Volle","Abr","Fe","Ges"]
[{"$f":"DKB!B32","v":0},1,null,{"$f":"SUM(F29-C29)","v":0},null,null,null,{"$f":"DKB!P32","v":0},1,null,{"$f":"SUM(M29-J29)","v":0}]
[null,2,null,{"$f":"SUM(F30-C30)","v":0},null,null,null,null,2,null,{"$f":"SUM(M30-J30)","v":0}]
[{"$f":"DKB!B35","v":0},3,null,{"$f":"SUM(F31-C31)","v":0},null,null,null,{"$f":"DKB!P35","v":0},3,null,{"$f":"SUM(M31-J31)","v":0}]
[null,4,null,{"$f":"SUM(F32-C32)","v":0},null,null,null,null,4,null,{"$f":"SUM(M32-J32)","v":0}]
[null,null,{"$f":"SUM(C29:C32)","v":0},{"$f":"SUM(D29:D32)","v":0},{"$f":"SUM(E29:E32)","v":0},{"$f":"SUM(F29:F32)","v":0},null,null,null,{"$f":"SUM(J29:J32)","v":0},{"$f":"SUM(K29:K32)","v":0},{"$f":"SUM(L29:L32)","v":0},{"$f":"SUM(M29:M32)","v":0}]
[]
[]
["Name","DG","Volle","Abr","Fe","Ges",null,"Name","DG","Volle","Abr","Fe","Ges"]
[{"$f":"DKB!B39","v":0},1,null,{"$f":"SUM(F37-C37)","v":0},null,null,null,{"$f":"DKB!P39","v":0},1,null,{"$f":"SUM(M37-J37)","v":0}]
[null,2,null,{"$f":"SUM(F38-C38)","v":0},null,null,null,null,2,null,{"$f":"SUM(M38-J38)","v":0}]
[{"$f":"DKB!B42","v":0},3,null,{"$f":"SUM(F39-C39)","v":0},null,null,null,{"$f":"DKB!P42","v":0},3,null,{"$f":"SUM(M39-J39)","v":0}]
[null,4,null,{"$f":"SUM(F40-C40)","v":0},null,null,null,null,4,null,{"$f":"SUM(M40-J40)","v":0}]
[null,null,{"$f":"SUM(C37:C40)","v":0},{"$f":"SUM(D37:D40)","v":0},{"$f":"SUM(E37:E40)","v":0},{"$f":"SUM(F37:F40)","v":0},null,null,null,{"$f":"SUM(J37:J40)","v":0},{"$f":"SUM(K37:K40)","v":0},{"$f":"SUM(L37:L40)","v":0},{"$f":"SUM(M37:M40)","v":0}]
[]
[]
["Name","DG","Volle","Abr","Fe","Ges",null,"Name","DG","Volle","Abr","Fe","Ges"]
[{"$f":"DKB!B46","v":0},1,null,{"$f":"SUM(F45-C45)","v":0},null,null,null,{"$f":"DKB!P46","v":0},1,null,{"$f":"SUM(M45-J45)","v":0}]
[null,2,null,{"$f":"SUM(F46-C46)","v":0},null,null,null,null,2,null,{"$f":"SUM(M46-J46)","v":0}]
[{"$f":"DKB!B49","v":0},3,null,{"$f":"SUM(F47-C47)","v":0},null,null,null,{"$f":"DKB!P49","v":0},3,null,{"$f":"SUM(M47-J47)","v":0}]
[null,4,null,{"$f":"SUM(F48-C48)","v":0},null,null,null,null,4,null,{"$f":"SUM(M48-J48)","v":0}]
[null,null,{"$f":"SUM(C45:C48)","v":0},{"$f":"SUM(D45:D48)","v":0},{"$f":"SUM(E45:E48)","v":0},{"$f":"SUM(F45:F48)","v":0},null,null,null,{"$f":"SUM(J45:J48)","v":0},{"$f":"SUM(K45:K48)","v":0},{"$f":"SUM(L45:L48)","v":0},{"$f":"SUM(M45:M48)","v":0}]
[]
[]
[]
["Eingabefelder"]

{"sheet":"MANNSCHAFTEN+SPIELER","index":2,"n_rows":233,"n_cols":21,"rows_kept":233,"cut":false,"hidden":true,"merged":[[0,0,0,6],[0,14,0,20],[2,1,2,2],[2,3,2,4],[2,5,2,6],[2,15,2,16],[2,17,2,18],[2,19,2,20],[23,1,23,2],[23,3,23,4],[23,5,23,6],[44,1,44,2],[44,3,44,4],[44,5,44,6],[65,1,65,2],[65,3,65,4],[65,5,65,6],[86,1,86,2],[86,3,86,4],[86,5,86,6],[107,1,107,2],[107,3,107,4],[107,5,107,6],[128,1,128,2],[128,3,128,4],[128,5,128,6],[149,1,149,2],[149,3,149,4],[149,5,149,6],[170,1,170,2],[170,3,170,4],[170,5,170,6],[191,1,191,2],[191,3,191,4],[191,5,191,6],[212,1,212,2],[212,3,212,4],[212,5,212,6]]}
["Gastmannschaften",null,null,null,null,null,null,null,null,null,null,null,null,null,"Heimmannschaft"]
["KLUB / Verein",null,"Mon/Jahr",null,"Paß-     Nummer",null,"Vorname, Name",null,null,null,null,null,null,null,"KLUB / Verein",null,"Mon/Jahr",null,"Paß-     Nummer",null,"Vorname, Name"]
["Dresdner SV 1910",1,null,1,null,1,null,null,null,null,null,null,null,null,"Königswarthaer SV",1,null,1,null,1]
[{"$f":"$A$3","v":"Dresdner SV 1910"},2,null,2,null,2,"Stefan Pogodda",null,null,null,null,null,null,null,{"$f":"$O$3","v":"Königswarthaer SV"},2,33,2,12345,2,"Alexander Grimmer"]
[{"$f":"$A$3","v":"Dresdner SV 1910"},3,null,3,null,3,"Veit Maruschke",null,null,null,null,null,null,null,{"$f":"$O$3","v":"Königswarthaer SV"},3,44,3,23456,3,"Jonas Kubitz"]
[{"$f":"$A$3","v":"Dresdner SV 1910"},4,null,4,null,4,"Andreas Kirsch",null,null,null,null,null,null,null,{"$f":"$O$3","v":"Königswarthaer SV"},4,22,4,34567,4,"Jonas Scholze"]
[{"$f":"$A$3","v":"Dresdner SV 1910"},5,null,5,null,5,"Kevin Nagy",null,null,null,null,null,null,null,{"$f":"$O$3","v":"Königswarthaer SV"},5,11,5,45678,5,"Georg Paschke"]
[{"$f":"$A$3","v":"Dresdner SV 1910"},6,null,6,null,6,"Sebastian Voll",null,null,null,null,null,null,null,{"$f":"$O$3","v":"Königswarthaer SV"},6,33,6,56789,6,"Tobias Spille"]
[{"$f":"$A$3","v":"Dresdner SV 1910"},7,null,7,null,7,"Robert Nake",null,null,null,null,null,null,null,{"$f":"$O$3","v":"Königswarthaer SV"},7,44,7,67890,7,"Sven Peter"]
[{"$f":"$A$3","v":"Dresdner SV 1910"},8,null,8,null,8,null,null,null,null,null,null,null,null,{"$f":"$O$3","v":"Königswarthaer SV"},8,null,8,null,8]
[{"$f":"$A$3","v":"Dresdner SV 1910"},9,null,9,null,9,null,null,null,null,null,null,null,null,{"$f":"$O$3","v":"Königswarthaer SV"},9,null,9,null,9]
[{"$f":"$A$3","v":"Dresdner SV 1910"},10,null,10,null,10,null,null,null,null,null,null,null,null,{"$f":"$O$3","v":"Königswarthaer SV"},10,null,10,null,10]
[{"$f":"$A$3","v":"Dresdner SV 1910"},11,null,11,null,11,null,null,null,null,null,null,null,null,{"$f":"$O$3","v":"Königswarthaer SV"},11,null,11,null,11]
[{"$f":"$A$3","v":"Dresdner SV 1910"},12,null,12,null,12,null,null,null,null,null,null,null,null,{"$f":"$O$3","v":"Königswarthaer SV"},12,null,12,null,12]
[{"$f":"$A$3","v":"Dresdner SV 1910"},13,null,13,null,13,null,1,"X",1,"eins",1,1,null,{"$f":"$O$3","v":"Königswarthaer SV"},13,null,13,null,13]
[{"$f":"$A$3","v":"Dresdner SV 1910"},14,null,14,null,14,null,null,null,null,null,null,null,null,{"$f":"$O$3","v":"Königswarthaer SV"},14,null,14,null,14]
[{"$f":"$A$3","v":"Dresdner SV 1910"},15,null,15,null,15,null,null,null,null,null,null,null,null,{"$f":"$O$3","v":"Königswarthaer SV"},15,null,15,null,15]
[{"$f":"$A$3","v":"Dresdner SV 1910"},16,null,16,null,16,null,null,null,null,null,null,null,null,{"$f":"$O$3","v":"Königswarthaer SV"},16,null,16,null,16]
[{"$f":"$A$3","v":"Dresdner SV 1910"},17,null,17,null,17,null,null,null,null,null,null,null,null,{"$f":"$O$3","v":"Königswarthaer SV"},17,null,17,null,17]
[{"$f":"$A$3","v":"Dresdner SV 1910"},18,null,18,null,18,null,null,null,null,null,null,null,null,{"$f":"$O$3","v":"Königswarthaer SV"},18,null,18,null,18]
[{"$f":"$A$3","v":"Dresdner SV 1910"},19,null,19,null,19,null,null,null,null,null,null,null,null,{"$f":"$O$3","v":"Königswarthaer SV"},19,null,19,null,19]
[{"$f":"$A$3","v":"Dresdner SV 1910"},20,null,20,null,20,null,null,null,null,null,null,null,null,{"$f":"$O$3","v":"Königswarthaer SV"},20,null,20,null,20]
[{"$f":"$A$3","v":"Dresdner SV 1910"},21,null,21,null,21,null,null,null,null,null,null,null,null,{"$f":"$O$3","v":"Königswarthaer SV"},21,null,21,null,21]
["KSV Dresden-Leuben 3.",1,null,1,null,1,null,2,null,2,"zwei",2,2,null,{"$f":"$O$3","v":"Königswarthaer SV"},22,null,22,null,22]
[{"$f":"$A$24","v":"KSV Dresden-Leuben 3."},2,null,2,null,2,"Torsten Weiss",null,null,3,"drei",3,3,null,{"$f":"$O$3","v":"Königswarthaer SV"},23,null,23,null,23]
[{"$f":"$A$24","v":"KSV Dresden-Leuben 3."},3,null,3,null,3,"Matthias Bitterlich",null,null,4,"vier",4,4,null,{"$f":"$O$3","v":"Königswarthaer SV"},24,null,24,null,24]
[{"$f":"$A$24","v":"KSV Dresden-Leuben 3."},4,null,4,null,4,"Monika Otto",null,null,5,"fünf",5,5,null,{"$f":"$O$3","v":"Königswarthaer SV"},25,null,25,null,25]
[{"$f":"$A$24","v":"KSV Dresden-Leuben 3."},5,null,5,null,5,"Jonas Liebscher",null,null,6,"sechs",6,6,null,{"$f":"$O$3","v":"Königswarthaer SV"},26,null,26,null,26]
[{"$f":"$A$24","v":"KSV Dresden-Leuben 3."},6,null,6,null,6,"Lutz Peschel",null,null,7,"sieben",7,"E",null,{"$f":"$O$3","v":"Königswarthaer SV"},27,null,27,null,27]
[{"$f":"$A$24","v":"KSV Dresden-Leuben 3."},7,null,7,null,7,"Lothar Mummert",null,null,8,"acht",8,"A",null,{"$f":"$O$3","v":"Königswarthaer SV"},28,null,28,null,28]
[{"$f":"$A$24","v":"KSV Dresden-Leuben 3."},8,null,8,null,8,null,null,null,9,"neun",9,null,null,{"$f":"$O$3","v":"Königswarthaer SV"},29,null,29,null,29]
[{"$f":"$A$24","v":"KSV Dresden-Leuben 3."},9,null,9,null,9,null,null,null,10,"zehn",null,null,null,{"$f":"$O$3","v":"Königswarthaer SV"},30,null,30,null,30]
[{"$f":"$A$24","v":"KSV Dresden-Leuben 3."},10,null,10,null,10,null,null,null,11,"elf",null,null,null,{"$f":"$O$3","v":"Königswarthaer SV"},31,null,31,null,31]
[{"$f":"$A$24","v":"KSV Dresden-Leuben 3."},11,null,11,null,11,null,null,null,12,"zwölf",null,null,null,{"$f":"$O$3","v":"Königswarthaer SV"},32,null,32,null,32]
[{"$f":"$A$24","v":"KSV Dresden-Leuben 3."},12,null,12,null,12,null,null,null,13,null,null,null,null,{"$f":"$O$3","v":"Königswarthaer SV"},33,null,33,null,33]
[{"$f":"$A$24","v":"KSV Dresden-Leuben 3."},13,null,13,null,13,null,null,null,null,null,null,null,null,{"$f":"$O$3","v":"Königswarthaer SV"},34,null,34,null,34]
[{"$f":"$A$24","v":"KSV Dresden-Leuben 3."},14,null,14,null,14,null,null,null,null,null,null,null,null,{"$f":"$O$3","v":"Königswarthaer SV"},35,null,35,null,35]
[{"$f":"$A$24","v":"KSV Dresden-Leuben 3."},15,null,15,null,15,null,null,null,null,null,null,null,null,{"$f":"$O$3","v":"Königswarthaer SV"},36,null,36,null,36]
[{"$f":"$A$24","v":"KSV Dresden-Leuben 3."},16,null,16,null,16,null,null,null,null,null,null,null,null,{"$f":"$O$3","v":"Königswarthaer SV"},37,null,37,null,37]
[{"$f":"$A$24","v":"KSV Dresden-Leuben 3."},17,null,17,null,17,null,null,null,null,null,null,null,null,{"$f":"$O$3","v":"Königswarthaer SV"},38,null,38,null,38]
[{"$f":"$A$24","v":"KSV Dresden-Leuben 3."},18,null,18,null,18,null,null,null,null,null,null,null,null,{"$f":"$O$3","v":"Königswarthaer SV"},39,null,39,null,39]
[{"$f":"$A$24","v":"KSV Dresden-Leuben 3."},19,null,19,null,19,null,null,null,null,null,null,null,null,{"$f":"$O$3","v":"Königswarthaer SV"},40,null,40,null,40]
[{"$f":"$A$24","v":"KSV Dresden-Leuben 3."},20,null,20,null,20,null,null,null,null,null,null,null,null,{"$f":"$O$3","v":"Königswarthaer SV"},41,null,41,null,41]
[{"$f":"$A$24","v":"KSV Dresden-Leuben 3."},21,null,21,null,21]
["VfB Hellerau-Klotzsche 2.",1,null,1,null,1]
[{"$f":"$A$45","v":"VfB Hellerau-Klotzsche 2."},2,null,2,null,2]
[{"$f":"$A$45","v":"VfB Hellerau-Klotzsche 2."},3,null,3,null,3]
[{"$f":"$A$45","v":"VfB Hellerau-Klotzsche 2."},4,null,4,null,4]
[{"$f":"$A$45","v":"VfB Hellerau-Klotzsche 2."},5,null,5,null,5]
[{"$f":"$A$45","v":"VfB Hellerau-Klotzsche 2."},6,null,6,null,6]
[{"$f":"$A$45","v":"VfB Hellerau-Klotzsche 2."},7,null,7,null,7]
[{"$f":"$A$45","v":"VfB Hellerau-Klotzsche 2."},8,null,8,null,8]
[{"$f":"$A$45","v":"VfB Hellerau-Klotzsche 2."},9,null,9,null,9]
[{"$f":"$A$45","v":"VfB Hellerau-Klotzsche 2."},10,null,10,null,10]
[{"$f":"$A$45","v":"VfB Hellerau-Klotzsche 2."},11,null,11,null,11]
[{"$f":"$A$45","v":"VfB Hellerau-Klotzsche 2."},12,null,12,null,12]
[{"$f":"$A$45","v":"VfB Hellerau-Klotzsche 2."},13,null,13,null,13]
[{"$f":"$A$45","v":"VfB Hellerau-Klotzsche 2."},14,null,14,null,14]
[{"$f":"$A$45","v":"VfB Hellerau-Klotzsche 2."},15,null,15,null,15]
[{"$f":"$A$45","v":"VfB Hellerau-Klotzsche 2."},16,null,16,null,16]
[{"$f":"$A$45","v":"VfB Hellerau-Klotzsche 2."},17,null,17,null,17]
[{"$f":"$A$45","v":"VfB Hellerau-Klotzsche 2."},18,null,18,null,18]
[{"$f":"$A$45","v":"VfB Hellerau-Klotzsche 2."},19,null,19,null,19]
[{"$f":"$A$45","v":"VfB Hellerau-Klotzsche 2."},20,null,20,null,20]
[{"$f":"$A$45","v":"VfB Hellerau-Klotzsche 2."},21,null,21,null,21]
["Kegelfreunde Dresden 1.",1,null,1,null,1]
[{"$f":"$A$66","v":"Kegelfreunde Dresden 1."},2,null,2,null,2,"KfD 1. 1"]
[{"$f":"$A$66","v":"Kegelfreunde Dresden 1."},3,null,3,null,3,"KfD 1. 2"]
[{"$f":"$A$66","v":"Kegelfreunde Dresden 1."},4,null,4,null,4,"KfD 1. 3"]
[{"$f":"$A$66","v":"Kegelfreunde Dresden 1."},5,null,5,null,5,"KfD 1. 4"]
[{"$f":"$A$66","v":"Kegelfreunde Dresden 1."},6,null,6,null,6,"KfD 1. 5"]
[{"$f":"$A$66","v":"Kegelfreunde Dresden 1."},7,null,7,null,7,"KfD 1. 6"]
[{"$f":"$A$66","v":"Kegelfreunde Dresden 1."},8,null,8,null,8]
[{"$f":"$A$66","v":"Kegelfreunde Dresden 1."},9,null,9,null,9]
[{"$f":"$A$66","v":"Kegelfreunde Dresden 1."},10,null,10,null,10]
[{"$f":"$A$66","v":"Kegelfreunde Dresden 1."},11,null,11,null,11]
[{"$f":"$A$66","v":"Kegelfreunde Dresden 1."},12,null,12,null,12]
[{"$f":"$A$66","v":"Kegelfreunde Dresden 1."},13,null,13,null,13]
[{"$f":"$A$66","v":"Kegelfreunde Dresden 1."},14,null,14,null,14]
[{"$f":"$A$66","v":"Kegelfreunde Dresden 1."},15,null,15,null,15]
[{"$f":"$A$66","v":"Kegelfreunde Dresden 1."},16,null,16,null,16]
[{"$f":"$A$66","v":"Kegelfreunde Dresden 1."},17,null,17,null,17]
[{"$f":"$A$66","v":"Kegelfreunde Dresden 1."},18,null,18,null,18]
[{"$f":"$A$66","v":"Kegelfreunde Dresden 1."},19,null,19,null,19]
[{"$f":"$A$66","v":"Kegelfreunde Dresden 1."},20,null,20,null,20]
[{"$f":"$A$66","v":"Kegelfreunde Dresden 1."},21,null,21,null,21]
["Kegelfreunde Dresden 2.",1,null,1,null,1]
[{"$f":"$A$87","v":"Kegelfreunde Dresden 2."},2,null,2,null,2,"KfD 2. 1","Gastmannschaft 05 2","Gastmannschaft 05 3","Gastmannschaft 05 4","Gastmannschaft 05 5","Gastmannschaft 05 6","Gastmannschaft 05 7"]
[{"$f":"$A$87","v":"Kegelfreunde Dresden 2."},3,null,3,null,3,"KfD 2. 2"]
[{"$f":"$A$87","v":"Kegelfreunde Dresden 2."},4,null,4,null,4,"KfD 2. 3"]
[{"$f":"$A$87","v":"Kegelfreunde Dresden 2."},5,null,5,null,5,"KfD 2. 4"]
[{"$f":"$A$87","v":"Kegelfreunde Dresden 2."},6,null,6,null,6,"KfD 2. 5"]
[{"$f":"$A$87","v":"Kegelfreunde Dresden 2."},7,null,7,null,7,"KfD 2. 6"]
[{"$f":"$A$87","v":"Kegelfreunde Dresden 2."},8,null,8,null,8]
[{"$f":"$A$87","v":"Kegelfreunde Dresden 2."},9,null,9,null,9]
[{"$f":"$A$87","v":"Kegelfreunde Dresden 2."},10,null,10,null,10]
[{"$f":"$A$87","v":"Kegelfreunde Dresden 2."},11,null,11,null,11]
[{"$f":"$A$87","v":"Kegelfreunde Dresden 2."},12,null,12,null,12]
[{"$f":"$A$87","v":"Kegelfreunde Dresden 2."},13,null,13,null,13]
[{"$f":"$A$87","v":"Kegelfreunde Dresden 2."},14,null,14,null,14]
[{"$f":"$A$87","v":"Kegelfreunde Dresden 2."},15,null,15,null,15]
[{"$f":"$A$87","v":"Kegelfreunde Dresden 2."},16,null,16,null,16]
[{"$f":"$A$87","v":"Kegelfreunde Dresden 2."},17,null,17,null,17]
[{"$f":"$A$87","v":"Kegelfreunde Dresden 2."},18,null,18,null,18]
[{"$f":"$A$87","v":"Kegelfreunde Dresden 2."},19,null,19,null,19]
[{"$f":"$A$87","v":"Kegelfreunde Dresden 2."},20,null,20,null,20]
[{"$f":"$A$87","v":"Kegelfreunde Dresden 2."},21,null,21,null,21]
["Gastmannschaft 6",1,null,1,null,1]
[{"$f":"$A$108","v":"Gastmannschaft 6"},2,null,2,null,2]
[{"$f":"$A$108","v":"Gastmannschaft 6"},3,null,3,null,3]
[{"$f":"$A$108","v":"Gastmannschaft 6"},4,null,4,null,4]
[{"$f":"$A$108","v":"Gastmannschaft 6"},5,null,5,null,5]
[{"$f":"$A$108","v":"Gastmannschaft 6"},6,null,6,null,6]
[{"$f":"$A$108","v":"Gastmannschaft 6"},7,null,7,null,7]
[{"$f":"$A$108","v":"Gastmannschaft 6"},8,null,8,null,8]
[{"$f":"$A$108","v":"Gastmannschaft 6"},9,null,9,null,9]
[{"$f":"$A$108","v":"Gastmannschaft 6"},10,null,10,null,10]
[{"$f":"$A$108","v":"Gastmannschaft 6"},11,null,11,null,11]
[{"$f":"$A$108","v":"Gastmannschaft 6"},12,null,12,null,12]
[{"$f":"$A$108","v":"Gastmannschaft 6"},13,null,13,null,13]
[{"$f":"$A$108","v":"Gastmannschaft 6"},14,null,14,null,14]
[{"$f":"$A$108","v":"Gastmannschaft 6"},15,null,15,null,15]
[{"$f":"$A$108","v":"Gastmannschaft 6"},16,null,16,null,16]
[{"$f":"$A$108","v":"Gastmannschaft 6"},17,null,17,null,17]
[{"$f":"$A$108","v":"Gastmannschaft 6"},18,null,18,null,18]
[{"$f":"$A$108","v":"Gastmannschaft 6"},19,null,19,null,19]
[{"$f":"$A$108","v":"Gastmannschaft 6"},20,null,20,null,20]
[{"$f":"$A$108","v":"Gastmannschaft 6"},21,null,21,null,21]
["Gastmannschaft 7",1,null,1,null,1]
[{"$f":"$A$129","v":"Gastmannschaft 7"},2,null,2,null,2]
[{"$f":"$A$129","v":"Gastmannschaft 7"},3,null,3,null,3]
[{"$f":"$A$129","v":"Gastmannschaft 7"},4,null,4,null,4]
[{"$f":"$A$129","v":"Gastmannschaft 7"},5,null,5,null,5]
[{"$f":"$A$129","v":"Gastmannschaft 7"},6,null,6,null,6]
[{"$f":"$A$129","v":"Gastmannschaft 7"},7,null,7,null,7]
[{"$f":"$A$129","v":"Gastmannschaft 7"},8,null,8,null,8]
[{"$f":"$A$129","v":"Gastmannschaft 7"},9,null,9,null,9]
[{"$f":"$A$129","v":"Gastmannschaft 7"},10,null,10,null,10]
[{"$f":"$A$129","v":"Gastmannschaft 7"},11,null,11,null,11]
[{"$f":"$A$129","v":"Gastmannschaft 7"},12,null,12,null,12]
[{"$f":"$A$129","v":"Gastmannschaft 7"},13,null,13,null,13]
[{"$f":"$A$129","v":"Gastmannschaft 7"},14,null,14,null,14]
[{"$f":"$A$129","v":"Gastmannschaft 7"},15,null,15,null,15]
[{"$f":"$A$129","v":"Gastmannschaft 7"},16,null,16,null,16]
[{"$f":"$A$129","v":"Gastmannschaft 7"},17,null,17,null,17]
[{"$f":"$A$129","v":"Gastmannschaft 7"},18,null,18,null,18]
[{"$f":"$A$129","v":"Gastmannschaft 7"},19,null,19,null,19]
[{"$f":"$A$129","v":"Gastmannschaft 7"},20,null,20,null,20]
[{"$f":"$A$129","v":"Gastmannschaft 7"},21,null,21,null,21]
["Gastmannschaft 8",1,null,1,null,1]
[{"$f":"$A$150","v":"Gastmannschaft 8"},2,null,2,null,2]
[{"$f":"$A$150","v":"Gastmannschaft 8"},3,null,3,null,3]
[{"$f":"$A$150","v":"Gastmannschaft 8"},4,null,4,null,4]
[{"$f":"$A$150","v":"Gastmannschaft 8"},5,null,5,null,5]
[{"$f":"$A$150","v":"Gastmannschaft 8"},6,null,6,null,6]
[{"$f":"$A$150","v":"Gastmannschaft 8"},7,null,7,null,7]
[{"$f":"$A$150","v":"Gastmannschaft 8"},8,null,8,null,8]
[{"$f":"$A$150","v":"Gastmannschaft 8"},9,null,9,null,9]
[{"$f":"$A$150","v":"Gastmannschaft 8"},10,null,10,null,10]
[{"$f":"$A$150","v":"Gastmannschaft 8"},11,null,11,null,11]
[{"$f":"$A$150","v":"Gastmannschaft 8"},12,null,12,null,12]
[{"$f":"$A$150","v":"Gastmannschaft 8"},13,null,13,null,13]
[{"$f":"$A$150","v":"Gastmannschaft 8"},14,null,14,null,14]
[{"$f":"$A$150","v":"Gastmannschaft 8"},15,null,15,null,15]
[{"$f":"$A$150","v":"Gastmannschaft 8"},16,null,16,null,16]
[{"$f":"$A$150","v":"Gastmannschaft 8"},17,null,17,null,17]
[{"$f":"$A$150","v":"Gastmannschaft 8"},18,null,18,null,18]
[{"$f":"$A$150","v":"Gastmannschaft 8"},19,null,19,null,19]
[{"$f":"$A$150","v":"Gastmannschaft 8"},20,null,20,null,20]
[{"$f":"$A$150","v":"Gastmannschaft 8"},21,null,21,null,21]
["Gastmannschaft 9",1,null,1,null,1]
[{"$f":"$A$171","v":"Gastmannschaft 9"},2,null,2,null,2]
[{"$f":"$A$171","v":"Gastmannschaft 9"},3,null,3,null,3]
[{"$f":"$A$171","v":"Gastmannschaft 9"},4,null,4,null,4]
[{"$f":"$A$171","v":"Gastmannschaft 9"},5,null,5,null,5]
[{"$f":"$A$171","v":"Gastmannschaft 9"},6,null,6,null,6]
[{"$f":"$A$171","v":"Gastmannschaft 9"},7,null,7,null,7]
[{"$f":"$A$171","v":"Gastmannschaft 9"},8,null,8,null,8]
[{"$f":"$A$171","v":"Gastmannschaft 9"},9,null,9,null,9]
[{"$f":"$A$171","v":"Gastmannschaft 9"},10,null,10,null,10]
[{"$f":"$A$171","v":"Gastmannschaft 9"},11,null,11,null,11]
[{"$f":"$A$171","v":"Gastmannschaft 9"},12,null,12,null,12]
[{"$f":"$A$171","v":"Gastmannschaft 9"},13,null,13,null,13]
[{"$f":"$A$171","v":"Gastmannschaft 9"},14,null,14,null,14]
[{"$f":"$A$171","v":"Gastmannschaft 9"},15,null,15,null,15]
[{"$f":"$A$171","v":"Gastmannschaft 9"},16,null,16,null,16]
[{"$f":"$A$171","v":"Gastmannschaft 9"},17,null,17,null,17]
[{"$f":"$A$171","v":"Gastmannschaft 9"},18,null,18,null,18]
[{"$f":"$A$171","v":"Gastmannschaft 9"},19,null,19,null,19]
[{"$f":"$A$171","v":"Gastmannschaft 9"},20,null,20,null,20]
[{"$f":"$A$171","v":"Gastmannschaft 9"},21,null,21,null,21]
["Gastmannschaft 10",1,null,1,null,1]
[{"$f":"$A$192","v":"Gastmannschaft 10"},2,null,2,null,2]
[{"$f":"$A$192","v":"Gastmannschaft 10"},3,null,3,null,3]
[{"$f":"$A$192","v":"Gastmannschaft 10"},4,null,4,null,4]
[{"$f":"$A$192","v":"Gastmannschaft 10"},5,null,5,null,5]
[{"$f":"$A$192","v":"Gastmannschaft 10"},6,null,6,null,6]
[{"$f":"$A$192","v":"Gastmannschaft 10"},7,null,7,null,7]
[{"$f":"$A$192","v":"Gastmannschaft 10"},8,null,8,null,8]
[{"$f":"$A$192","v":"Gastmannschaft 10"},9,null,9,null,9]
[{"$f":"$A$192","v":"Gastmannschaft 10"},10,null,10,null,10]
[{"$f":"$A$192","v":"Gastmannschaft 10"},11,null,11,null,11]
[{"$f":"$A$192","v":"Gastmannschaft 10"},12,null,12,null,12]
[{"$f":"$A$192","v":"Gastmannschaft 10"},13,null,13,null,13]
[{"$f":"$A$192","v":"Gastmannschaft 10"},14,null,14,null,14]
[{"$f":"$A$192","v":"Gastmannschaft 10"},15,null,15,null,15]
[{"$f":"$A$192","v":"Gastmannschaft 10"},16,null,16,null,16]
[{"$f":"$A$192","v":"Gastmannschaft 10"},17,null,17,null,17]
[{"$f":"$A$192","v":"Gastmannschaft 10"},18,null,18,null,18]
[{"$f":"$A$192","v":"Gastmannschaft 10"},19,null,19,null,19]
[{"$f":"$A$192","v":"Gastmannschaft 10"},20,null,20,null,20]
[{"$f":"$A$192","v":"Gastmannschaft 10"},21,null,21,null,21]
["Gastmannschaft 11",1,null,1,null,1]
[{"$f":"$A$213","v":"Gastmannschaft 11"},2,null,2,null,2]
[{"$f":"$A$213","v":"Gastmannschaft 11"},3,null,3,null,3]
[{"$f":"$A$213","v":"Gastmannschaft 11"},4,null,4,null,4]
[{"$f":"$A$213","v":"Gastmannschaft 11"},5,null,5,null,5]
[{"$f":"$A$213","v":"Gastmannschaft 11"},6,null,6,null,6]
[{"$f":"$A$213","v":"Gastmannschaft 11"},7,null,7,null,7]
[{"$f":"$A$213","v":"Gastmannschaft 11"},8,null,8,null,8]
[{"$f":"$A$213","v":"Gastmannschaft 11"},9,null,9,null,9]
[{"$f":"$A$213","v":"Gastmannschaft 11"},10,null,10,null,10]
[{"$f":"$A$213","v":"Gastmannschaft 11"},11,null,11,null,11]
[{"$f":"$A$213","v":"Gastmannschaft 11"},12,null,12,null,12]
[{"$f":"$A$213","v":"Gastmannschaft 11"},13,null,13,null,13]
[{"$f":"$A$213","v":"Gastmannschaft 11"},14,null,14,null,14]
[{"$f":"$A$213","v":"Gastmannschaft 11"},15,null,15,null,15]
[{"$f":"$A$213","v":"Gastmannschaft 11"},16,null,16,null,16]
[{"$f":"$A$213","v":"Gastmannschaft 11"},17,null,17,null,17]
[{"$f":"$A$213","v":"Gastmannschaft 11"},18,null,18,null,18]
[{"$f":"$A$213","v":"Gastmannschaft 11"},19,null,19,null,19]
[{"$f":"$A$213","v":"Gastmannschaft 11"},20,null,20,null,20]
[{"$f":"$A$213","v":"Gastmannschaft 11"},21,null,21,null,21]

{"sheet":"Beamer_1","index":3,"n_rows":48,"n_cols":17,"rows_kept":48,"cut":false,"hidden":false,"merged":[[0,0,0,6],[0,7,0,9],[0,10,0,16],[1,7,2,9],[3,0,4,0],[3,6,8,6],[3,10,8,10],[3,16,4,16],[4,7,4,9],[6,0,7,0],[6,7,6,9],[6,16,7,16],[8,7,8,9],[9,7,11,9],[10,0,11,0],[10,6,15,6],[10,10,15,10],[10,16,11,16],[13,0,14,0],[13,7,13,9],[13,16,14,16],[15,7,15,9],[17,0,18,0],[17,6,22,6],[17,10,22,10],[17,16,18,16],[18,7,18,9],[20,0,21,0],[20,7,20,9],[20,16,21,16],[24,0,25,0],[24,6,29,6],[24,10,29,10],[24,16,25,16],[27,0,28,0],[27,16,28,16],[31,0,32,0],[31,6,36,6],[31,10,36,10],[31,16,32,16],[32,7,32,9],[34,0,35,0],[34,7,34,9],[34,16,35,16],[38,0,39,0],[38,6,43,6],[38,10,43,10],[38,16,39,16],[41,0,42,0],[41,16,42,16],[44,0,45,2],[44,3,45,3],[44,4,45,4],[44,5,45,5],[44,6,45,6],[44,7,45,9],[44,10,45,10],[44,11,45,11],[44,12,45,12],[44,13,45,13],[44,14,45,16],[46,0,46,2],[46,4,46,5],[46,7,46,9],[46,11,46,12],[46,14,46,16],[47,0,47,2],[47,14,47,16]]}
[{"$f":"\"Heimmannschaft:     \"&DKB!D8","v":"Heimmannschaft:     Heimmannschaft"},null,null,null,null,null,null,"Spiele Nummer",null,null,{"$f":"\"Gastmannschaft:     \"&DKB!R8","v":"Gastmannschaft:     Gastmannschaft"}]
[null,null,null,null,null,null,null,{"$f":"DKB!L8","v":0}]
["Name","DG",1,2,3,4,"MP",null,null,null,"MP",4,3,2,1,"DG","Name"]
[{"$f":"DKB!B11","v":0},null,null,null,null,null,{"$f":"DKB!K11","v":""},null,null,null,{"$f":"DKB!Y11","v":""},null,null,null,null,null,{"$f":"DKB!P11","v":0}]
[null,null,{"$f":"DKB!H11","v":""},{"$f":"DKB!H12","v":""},{"$f":"DKB!H14","v":""},{"$f":"DKB!H15","v":""},null,null,null,null,null,{"$f":"DKB!V15","v":""},{"$f":"DKB!V14","v":""},{"$f":"DKB!V12","v":""},{"$f":"DKB!V11","v":""}]
[]
[{"$f":"DKB!B14","v":0},"SP",{"$f":"DKB!J11","v":""},{"$f":"DKB!J12","v":""},{"$f":"DKB!J14","v":""},{"$f":"DKB!J15","v":""},null,null,null,null,null,{"$f":"DKB!X15","v":""},{"$f":"DKB!X14","v":""},{"$f":"DKB!X12","v":""},{"$f":"DKB!X11","v":""},"SP",{"$f":"DKB!P14","v":0}]
[null,null,null,null,"Gesamt","SP",null,null,null,null,null,"Gesamt","SP"]
[null,null,null,null,{"$f":"DKB!H16","v":""},{"$f":"DKB!J16","v":""},null,"Liga / Klasse",null,null,null,{"$f":"DKB!V16","v":""},{"$f":"DKB!X16","v":""}]
["Name","DG",1,2,3,4,"MP",{"$f":"DKB!P6","v":0},null,null,"MP",4,3,2,1,"DG","Name"]
[{"$f":"DKB!B18","v":0},null,null,null,null,null,{"$f":"DKB!K18","v":""},null,null,null,{"$f":"DKB!Y18","v":""},null,null,null,null,null,{"$f":"DKB!P18","v":0}]
[null,null,{"$f":"DKB!H18","v":""},{"$f":"DKB!H19","v":""},{"$f":"DKB!H21","v":""},{"$f":"DKB!H22","v":""},null,null,null,null,null,{"$f":"DKB!V22","v":""},{"$f":"DKB!V21","v":""},{"$f":"DKB!V19","v":""},{"$f":"DKB!V18","v":""}]
[]
[{"$f":"DKB!B21","v":0},"SP",{"$f":"DKB!J18","v":""},{"$f":"DKB!J19","v":""},{"$f":"DKB!J21","v":""},{"$f":"DKB!J22","v":""},null,"Datum:",null,null,null,{"$f":"DKB!X22","v":""},{"$f":"DKB!X21","v":""},{"$f":"DKB!X19","v":""},{"$f":"DKB!X18","v":""},"SP",{"$f":"DKB!P21","v":0}]
[null,null,null,null,"Gesamt","SP",null,null,null,null,null,"Gesamt","SP"]
[null,null,null,null,{"$f":"DKB!H23","v":""},{"$f":"DKB!J23","v":""},null,{"$f":"DKB!V3","v":"2020-07-16"},null,null,null,{"$f":"DKB!V23","v":""},{"$f":"DKB!X23","v":""}]
["Name","DG",1,2,3,4,"MP",null,null,null,"MP",4,3,2,1,"DG","Name"]
[{"$f":"DKB!B25","v":0},null,null,null,null,null,{"$f":"DKB!K25","v":""},null,null,null,{"$f":"DKB!Y25","v":""},null,null,null,null,null,{"$f":"DKB!P25","v":0}]
[null,null,{"$f":"DKB!H25","v":""},{"$f":"DKB!H26","v":""},{"$f":"DKB!H28","v":""},{"$f":"DKB!H29","v":""},null,"Spieltag:",null,null,null,{"$f":"DKB!V29","v":""},{"$f":"DKB!V28","v":""},{"$f":"DKB!V26","v":""},{"$f":"DKB!V25","v":""}]
[]
[{"$f":"DKB!B28","v":0},"SP",{"$f":"DKB!J25","v":""},{"$f":"DKB!J26","v":""},{"$f":"DKB!J28","v":""},{"$f":"DKB!J29","v":""},null,{"$f":"DKB!Y7","v":0},null,null,null,{"$f":"DKB!X29","v":""},{"$f":"DKB!X28","v":""},{"$f":"DKB!X26","v":""},{"$f":"DKB!X25","v":""},"SP",{"$f":"DKB!P28","v":0}]
[null,null,null,null,"Gesamt","SP",null,null,null,null,null,"Gesamt","SP"]
[null,null,null,null,{"$f":"DKB!H30","v":""},{"$f":"DKB!J30","v":""},null,null,null,null,null,{"$f":"DKB!V30","v":""},{"$f":"DKB!X30","v":""}]
["Name","DG",1,2,3,4,"MP",null,null,null,"MP",4,3,2,1,"DG","Name"]
[{"$f":"DKB!B32","v":0},null,null,null,null,null,{"$f":"DKB!K32","v":""},null,null,null,{"$f":"DKB!Y32","v":""},null,null,null,null,null,{"$f":"DKB!P32","v":0}]
[null,null,{"$f":"DKB!H32","v":""},{"$f":"DKB!H33","v":""},{"$f":"DKB!H35","v":""},{"$f":"DKB!H36","v":""},null,null,null,null,null,{"$f":"DKB!V36","v":""},{"$f":"DKB!V35","v":""},{"$f":"DKB!V33","v":""},{"$f":"DKB!V32","v":""}]
[]
[{"$f":"DKB!B35","v":0},"SP",{"$f":"DKB!J32","v":""},{"$f":"DKB!J33","v":""},{"$f":"DKB!J35","v":""},{"$f":"DKB!J36","v":""},null,null,null,null,null,{"$f":"DKB!X36","v":""},{"$f":"DKB!X35","v":""},{"$f":"DKB!X33","v":""},{"$f":"DKB!X32","v":""},"SP",{"$f":"DKB!P35","v":0}]
[null,null,null,null,"Gesamt","SP",null,null,null,null,null,"Gesamt","SP"]
[null,null,null,null,{"$f":"DKB!H37","v":""},{"$f":"DKB!J37","v":""},null,null,null,null,null,{"$f":"DKB!V37","v":""},{"$f":"DKB!X37","v":""}]
["Name","DG",1,2,3,4,"MP",null,null,null,"MP",4,3,2,1,"DG","Name"]
[{"$f":"DKB!B39","v":0},null,null,null,null,null,{"$f":"DKB!K39","v":""},null,null,null,{"$f":"DKB!Y39","v":""},null,null,null,null,null,{"$f":"DKB!P39","v":0}]
[null,null,{"$f":"DKB!H39","v":""},{"$f":"DKB!H40","v":""},{"$f":"DKB!H42","v":""},{"$f":"DKB!H43","v":""},null,null,null,null,null,{"$f":"DKB!V43","v":""},{"$f":"DKB!V42","v":""},{"$f":"DKB!V40","v":""},{"$f":"DKB!V39","v":""}]
[]
[{"$f":"DKB!B42","v":0},"SP",{"$f":"DKB!J39","v":""},{"$f":"DKB!J40","v":""},{"$f":"DKB!J42","v":""},{"$f":"DKB!J43","v":""},null,null,null,null,null,{"$f":"DKB!X43","v":""},{"$f":"DKB!X42","v":""},{"$f":"DKB!X40","v":""},{"$f":"DKB!X39","v":""},"SP",{"$f":"DKB!P42","v":0}]
[null,null,null,null,"Gesamt","SP",null,null,null,null,null,"Gesamt","SP"]
[null,null,null,null,{"$f":"DKB!H44","v":""},{"$f":"DKB!J44","v":""},null,null,null,null,null,{"$f":"DKB!V44","v":""},{"$f":"DKB!X44","v":""}]
["Name","DG",1,2,3,4,"MP",null,null,null,"MP",4,3,2,1,"DG","Name"]
[{"$f":"DKB!B46","v":0},null,null,null,null,null,{"$f":"DKB!K46","v":""},null,null,null,{"$f":"DKB!Y46","v":""},null,null,null,null,null,{"$f":"DKB!P46","v":0}]
[null,null,{"$f":"DKB!H46","v":""},{"$f":"DKB!H47","v":""},{"$f":"DKB!H49","v":""},{"$f":"DKB!H50","v":""},null,null,null,null,null,{"$f":"DKB!V50","v":""},{"$f":"DKB!V49","v":""},{"$f":"DKB!V47","v":""},{"$f":"DKB!V46","v":""}]
[]
[{"$f":"DKB!B49","v":0},"SP",{"$f":"DKB!J46","v":""},{"$f":"DKB!J47","v":""},{"$f":"DKB!J49","v":""},{"$f":"DKB!J50","v":""},null,null,null,null,null,{"$f":"DKB!X50","v":""},{"$f":"DKB!X49","v":""},{"$f":"DKB!X47","v":""},{"$f":"DKB!X46","v":""},"SP",{"$f":"DKB!P49","v":0}]
[null,null,null,null,"Gesamt","SP",null,null,null,null,null,"Gesamt","SP"]
[null,null,null,null,{"$f":"DKB!H51","v":""},{"$f":"DKB!J51","v":""},null,null,null,null,null,{"$f":"DKB!V51","v":""},{"$f":"DKB!X51","v":""}]
["Satz- Mannschaftspunkte:",null,null,{"$f":"SUM(DKB!J53)","v":0},"SP","MP",{"$f":"SUM(DKB!K53)","v":0},"Endstand",null,null,{"$f":"SUM(DKB!Y53)","v":0},"MP","SP",{"$f":"SUM(DKB!X53)","v":0},"Satz- Mannschaftspunkte:"]
[]
["Gesamtkegel-Kegelpunkte:",null,null,null,{"$f":"DKB!D54","v":""},null,{"$f":"DKB!J54","v":""},"Tabellenpunkte",null,null,{"$f":"DKB!X54","v":""},{"$f":"DKB!R54","v":""},null,null,"Gesamtkegel-Kegelpunkte:"]
["Gesamt Mannschaftspunkte:",null,null,null,null,null,{"$f":"DKB!L54","v":""},{"$f":"DKB!L55","v":""},":",{"$f":"DKB!N55","v":""},{"$f":"DKB!N54","v":""},null,null,null,"Gesamt Mannschaftspunkte:"]

{"sheet":"Dialog","index":4,"n_rows":0,"n_cols":0,"rows_kept":0,"cut":false,"hidden":true,"merged":[]}

{"sheet":"Dialog2","index":5,"n_rows":0,"n_cols":0,"rows_kept":0,"cut":false,"hidden":true,"merged":[]}

{"sheet":"Dialog3","index":6,"n_rows":0,"n_cols":0,"rows_kept":0,"cut":false,"hidden":true,"merged":[]}

{"sheet":"übertrag","index":7,"n_rows":60,"n_cols":31,"rows_kept":60,"cut":false,"hidden":true,"merged":[[0,16,0,17]]}
[null,null,null,null,null,null,null,null,null,null,"Spieler 1 - 6","Spieler 7 - 12","geb.jahr 1 - 6","geb.jahr 7 - 12 - 6","paß.Nr 1 - 6","paß.Nr 7 - 12","Eingane der Kreuze",null,null,null,null,"Gastmannschaft",null,"Heim",null,null,null,null,null,null,"Spieltag"]
[13,9,9,13,null,4,null,1,2,null,{"$f":"IF(übertrag!$H$2=1,VLOOKUP(übertrag!I2,einsü,2, ),IF($H$2=2,VLOOKUP(übertrag!I2,zweiü,2, ),IF($H$2=3,VLOOKUP(übertrag!I2,dreiü,2, ),IF($H$2=4,VLOOKUP(übertrag!I2,vierü,2, ),IF($H$2=5,VLOOKUP(übertrag!I2,fünfü,2, ),IF($H$2=6,VLOOKUP(übertrag!I2,sechsü,2, ),\"\"))))))","v":"Stefan Pogodda"},{"$f":"IF(übertrag!$H$2=7,VLOOKUP(übertrag!I2,siebenü,2, ),IF($H$2=8,VLOOKUP(übertrag!I2,achtü,2, ),IF($H$2=9,VLOOKUP(übertrag!I2,neunü,2, ),IF($H$2=10,VLOOKUP(übertrag!I2,zehnü,2, ),IF($H$2=11,VLOOKUP(übertrag!I2,elfü,2, ),IF($H$2=12,VLOOKUP(übertrag!I2,Heimü,2, ),\"\"))))))","v":""},{"$f":"IF(übertrag!$H$2=1,VLOOKUP(übertrag!I2,jhg1,2, ),IF($H$2=2,VLOOKUP(übertrag!I2,jhg2,2, ),IF($H$2=3,VLOOKUP(übertrag!I2,jhg3,2, ),IF($H$2=4,VLOOKUP(übertrag!I2,jhg4,2, ),IF($H$2=5,VLOOKUP(übertrag!I2,jhg5,2, ),IF($H$2=6,VLOOKUP(übertrag!I2,jhg6,2, ),\"\"))))))","v":{"$error":"#NAME?"}},{"$f":"IF(übertrag!$H$2=7,VLOOKUP(übertrag!I2,jhg7,2, ),IF($H$2=8,VLOOKUP(übertrag!I2,jhg8,2, ),IF($H$2=9,VLOOKUP(übertrag!I2,jhg9,2, ),IF($H$2=10,VLOOKUP(übertrag!I2,jhg10,2, ),IF($H$2=11,VLOOKUP(übertrag!I2,jhg11,2, ),IF($H$2=12,VLOOKUP(übertrag!I2,jhgheim,2, ),\"\"))))))","v":""},{"$f":"IF(übertrag!$H$2=1,VLOOKUP(übertrag!I2,paß1,2, ),IF($H$2=2,VLOOKUP(übertrag!I2,paß2,2, ),IF($H$2=3,VLOOKUP(übertrag!I2,paß3,2, ),IF($H$2=4,VLOOKUP(übertrag!I2,paß4,2, ),IF($H$2=5,VLOOKUP(übertrag!I2,paß5,2, ),IF($H$2=6,VLOOKUP(übertrag!I2,paß6,2, ),\"\"))))))","v":0},{"$f":"IF(übertrag!$H$2=7,VLOOKUP(übertrag!I2,paß7,2, ),IF($H$2=8,VLOOKUP(übertrag!I2,paß8,2, ),IF($H$2=9,VLOOKUP(übertrag!I2,paß9,2, ),IF($H$2=10,VLOOKUP(übertrag!I2,paß10,2, ),IF($H$2=11,VLOOKUP(übertrag!I2,paß11,2, ),IF($H$2=12,VLOOKUP(übertrag!I2,paßheim,2, ),\"\"))))))","v":""},{"$f":"FALSE()","v":0},{"$f":"FALSE()","v":0},null,null,1,{"$f":"'MANNSCHAFTEN+SPIELER'!A3","v":"Dresdner SV 1910"},null,null,null,{"$f":"IF(I16,VLOOKUP(übertrag!I16,Heimü,2, ),\"\")","v":"Alexander Grimmer"},null,null,null,null,1]
[13,1,null,13,null,null,null,null,3,null,{"$f":"IF(übertrag!$H$2=1,VLOOKUP(übertrag!I3,einsü,2, ),IF($H$2=2,VLOOKUP(übertrag!I3,zweiü,2, ),IF($H$2=3,VLOOKUP(übertrag!I3,dreiü,2, ),IF($H$2=4,VLOOKUP(übertrag!I3,vierü,2, ),IF($H$2=5,VLOOKUP(übertrag!I3,fünfü,2, ),IF($H$2=6,VLOOKUP(übertrag!I3,sechsü,2, ),\"\"))))))","v":"Veit Maruschke"},{"$f":"IF(übertrag!$H$2=7,VLOOKUP(übertrag!I3,siebenü,2, ),IF($H$2=8,VLOOKUP(übertrag!I3,achtü,2, ),IF($H$2=9,VLOOKUP(übertrag!I3,neunü,2, ),IF($H$2=10,VLOOKUP(übertrag!I3,zehnü,2, ),IF($H$2=11,VLOOKUP(übertrag!I3,elfü,2, ),IF($H$2=12,VLOOKUP(übertrag!I3,Heimü,2, ),\"\"))))))","v":""},{"$f":"IF(übertrag!$H$2=1,VLOOKUP(übertrag!I3,jhg1,2, ),IF($H$2=2,VLOOKUP(übertrag!I3,jhg2,2, ),IF($H$2=3,VLOOKUP(übertrag!I3,jhg3,2, ),IF($H$2=4,VLOOKUP(übertrag!I3,jhg4,2, ),IF($H$2=5,VLOOKUP(übertrag!I3,jhg5,2, ),IF($H$2=6,VLOOKUP(übertrag!I3,jhg6,2, ),\"\"))))))","v":{"$error":"#NAME?"}},{"$f":"IF(übertrag!$H$2=7,VLOOKUP(übertrag!I3,jhg7,2, ),IF($H$2=8,VLOOKUP(übertrag!I3,jhg8,2, ),IF($H$2=9,VLOOKUP(übertrag!I3,jhg9,2, ),IF($H$2=10,VLOOKUP(übertrag!I3,jhg10,2, ),IF($H$2=11,VLOOKUP(übertrag!I3,jhg11,2, ),IF($H$2=12,VLOOKUP(übertrag!I3,jhgheim,2, ),\"\"))))))","v":""},{"$f":"IF(übertrag!$H$2=1,VLOOKUP(übertrag!I3,paß1,2, ),IF($H$2=2,VLOOKUP(übertrag!I3,paß2,2, ),IF($H$2=3,VLOOKUP(übertrag!I3,paß3,2, ),IF($H$2=4,VLOOKUP(übertrag!I3,paß4,2, ),IF($H$2=5,VLOOKUP(übertrag!I3,paß5,2, ),IF($H$2=6,VLOOKUP(übertrag!I3,paß6,2, ),\"\"))))))","v":0},{"$f":"IF(übertrag!$H$2=7,VLOOKUP(übertrag!I3,paß7,2, ),IF($H$2=8,VLOOKUP(übertrag!I3,paß8,2, ),IF($H$2=9,VLOOKUP(übertrag!I3,paß9,2, ),IF($H$2=10,VLOOKUP(übertrag!I3,paß10,2, ),IF($H$2=11,VLOOKUP(übertrag!I3,paß11,2, ),IF($H$2=12,VLOOKUP(übertrag!I3,paßheim,2, ),\"\"))))))","v":""},{"$f":"FALSE()","v":0},{"$f":"FALSE()","v":0},null,null,2,{"$f":"'MANNSCHAFTEN+SPIELER'!A24","v":"KSV Dresden-Leuben 3."},null,null,null,{"$f":"IF(I17,VLOOKUP(übertrag!I17,Heimü,2, ),\"\")","v":"Jonas Kubitz"},null,null,null,null,2]
[13,9,9,13,null,null,null,null,4,null,{"$f":"IF(übertrag!$H$2=1,VLOOKUP(übertrag!I4,einsü,2, ),IF($H$2=2,VLOOKUP(übertrag!I4,zweiü,2, ),IF($H$2=3,VLOOKUP(übertrag!I4,dreiü,2, ),IF($H$2=4,VLOOKUP(übertrag!I4,vierü,2, ),IF($H$2=5,VLOOKUP(übertrag!I4,fünfü,2, ),IF($H$2=6,VLOOKUP(übertrag!I4,sechsü,2, ),\"\"))))))","v":"Andreas Kirsch"},{"$f":"IF(übertrag!$H$2=7,VLOOKUP(übertrag!I4,siebenü,2, ),IF($H$2=8,VLOOKUP(übertrag!I4,achtü,2, ),IF($H$2=9,VLOOKUP(übertrag!I4,neunü,2, ),IF($H$2=10,VLOOKUP(übertrag!I4,zehnü,2, ),IF($H$2=11,VLOOKUP(übertrag!I4,elfü,2, ),IF($H$2=12,VLOOKUP(übertrag!I4,Heimü,2, ),\"\"))))))","v":""},{"$f":"IF(übertrag!$H$2=1,VLOOKUP(übertrag!I4,jhg1,2, ),IF($H$2=2,VLOOKUP(übertrag!I4,jhg2,2, ),IF($H$2=3,VLOOKUP(übertrag!I4,jhg3,2, ),IF($H$2=4,VLOOKUP(übertrag!I4,jhg4,2, ),IF($H$2=5,VLOOKUP(übertrag!I4,jhg5,2, ),IF($H$2=6,VLOOKUP(übertrag!I4,jhg6,2, ),\"\"))))))","v":{"$error":"#NAME?"}},{"$f":"IF(übertrag!$H$2=7,VLOOKUP(übertrag!I4,jhg7,2, ),IF($H$2=8,VLOOKUP(übertrag!I4,jhg8,2, ),IF($H$2=9,VLOOKUP(übertrag!I4,jhg9,2, ),IF($H$2=10,VLOOKUP(übertrag!I4,jhg10,2, ),IF($H$2=11,VLOOKUP(übertrag!I4,jhg11,2, ),IF($H$2=12,VLOOKUP(übertrag!I4,jhgheim,2, ),\"\"))))))","v":""},{"$f":"IF(übertrag!$H$2=1,VLOOKUP(übertrag!I4,paß1,2, ),IF($H$2=2,VLOOKUP(übertrag!I4,paß2,2, ),IF($H$2=3,VLOOKUP(übertrag!I4,paß3,2, ),IF($H$2=4,VLOOKUP(übertrag!I4,paß4,2, ),IF($H$2=5,VLOOKUP(übertrag!I4,paß5,2, ),IF($H$2=6,VLOOKUP(übertrag!I4,paß6,2, ),\"\"))))))","v":0},{"$f":"IF(übertrag!$H$2=7,VLOOKUP(übertrag!I4,paß7,2, ),IF($H$2=8,VLOOKUP(übertrag!I4,paß8,2, ),IF($H$2=9,VLOOKUP(übertrag!I4,paß9,2, ),IF($H$2=10,VLOOKUP(übertrag!I4,paß10,2, ),IF($H$2=11,VLOOKUP(übertrag!I4,paß11,2, ),IF($H$2=12,VLOOKUP(übertrag!I4,paßheim,2, ),\"\"))))))","v":""},{"$f":"FALSE()","v":0},null,null,null,3,{"$f":"'MANNSCHAFTEN+SPIELER'!A45","v":"VfB Hellerau-Klotzsche 2."},null,null,null,{"$f":"IF(I18,VLOOKUP(übertrag!I18,Heimü,2, ),\"\")","v":"Jonas Scholze"},null,null,null,null,3]
[13,1,null,13,null,null,null,null,5,null,{"$f":"IF(übertrag!$H$2=1,VLOOKUP(übertrag!I5,einsü,2, ),IF($H$2=2,VLOOKUP(übertrag!I5,zweiü,2, ),IF($H$2=3,VLOOKUP(übertrag!I5,dreiü,2, ),IF($H$2=4,VLOOKUP(übertrag!I5,vierü,2, ),IF($H$2=5,VLOOKUP(übertrag!I5,fünfü,2, ),IF($H$2=6,VLOOKUP(übertrag!I5,sechsü,2, ),\"\"))))))","v":"Kevin Nagy"},{"$f":"IF(übertrag!$H$2=7,VLOOKUP(übertrag!I5,siebenü,2, ),IF($H$2=8,VLOOKUP(übertrag!I5,achtü,2, ),IF($H$2=9,VLOOKUP(übertrag!I5,neunü,2, ),IF($H$2=10,VLOOKUP(übertrag!I5,zehnü,2, ),IF($H$2=11,VLOOKUP(übertrag!I5,elfü,2, ),IF($H$2=12,VLOOKUP(übertrag!I5,Heimü,2, ),\"\"))))))","v":""},{"$f":"IF(übertrag!$H$2=1,VLOOKUP(übertrag!I5,jhg1,2, ),IF($H$2=2,VLOOKUP(übertrag!I5,jhg2,2, ),IF($H$2=3,VLOOKUP(übertrag!I5,jhg3,2, ),IF($H$2=4,VLOOKUP(übertrag!I5,jhg4,2, ),IF($H$2=5,VLOOKUP(übertrag!I5,jhg5,2, ),IF($H$2=6,VLOOKUP(übertrag!I5,jhg6,2, ),\"\"))))))","v":{"$error":"#NAME?"}},{"$f":"IF(übertrag!$H$2=7,VLOOKUP(übertrag!I5,jhg7,2, ),IF($H$2=8,VLOOKUP(übertrag!I5,jhg8,2, ),IF($H$2=9,VLOOKUP(übertrag!I5,jhg9,2, ),IF($H$2=10,VLOOKUP(übertrag!I5,jhg10,2, ),IF($H$2=11,VLOOKUP(übertrag!I5,jhg11,2, ),IF($H$2=12,VLOOKUP(übertrag!I5,jhgheim,2, ),\"\"))))))","v":""},{"$f":"IF(übertrag!$H$2=1,VLOOKUP(übertrag!I5,paß1,2, ),IF($H$2=2,VLOOKUP(übertrag!I5,paß2,2, ),IF($H$2=3,VLOOKUP(übertrag!I5,paß3,2, ),IF($H$2=4,VLOOKUP(übertrag!I5,paß4,2, ),IF($H$2=5,VLOOKUP(übertrag!I5,paß5,2, ),IF($H$2=6,VLOOKUP(übertrag!I5,paß6,2, ),\"\"))))))","v":0},{"$f":"IF(übertrag!$H$2=7,VLOOKUP(übertrag!I5,paß7,2, ),IF($H$2=8,VLOOKUP(übertrag!I5,paß8,2, ),IF($H$2=9,VLOOKUP(übertrag!I5,paß9,2, ),IF($H$2=10,VLOOKUP(übertrag!I5,paß10,2, ),IF($H$2=11,VLOOKUP(übertrag!I5,paß11,2, ),IF($H$2=12,VLOOKUP(übertrag!I5,paßheim,2, ),\"\"))))))","v":""},{"$f":"FALSE()","v":0},null,null,null,4,{"$f":"'MANNSCHAFTEN+SPIELER'!A66","v":"Kegelfreunde Dresden 1."},null,null,null,{"$f":"IF(I19,VLOOKUP(übertrag!I19,Heimü,2, ),\"\")","v":"Georg Paschke"},null,null,null,null,4]
[13,9,9,13,null,null,null,null,6,null,{"$f":"IF(übertrag!$H$2=1,VLOOKUP(übertrag!I6,einsü,2, ),IF($H$2=2,VLOOKUP(übertrag!I6,zweiü,2, ),IF($H$2=3,VLOOKUP(übertrag!I6,dreiü,2, ),IF($H$2=4,VLOOKUP(übertrag!I6,vierü,2, ),IF($H$2=5,VLOOKUP(übertrag!I6,fünfü,2, ),IF($H$2=6,VLOOKUP(übertrag!I6,sechsü,2, ),\"\"))))))","v":"Sebastian Voll"},{"$f":"IF(übertrag!$H$2=7,VLOOKUP(übertrag!I6,siebenü,2, ),IF($H$2=8,VLOOKUP(übertrag!I6,achtü,2, ),IF($H$2=9,VLOOKUP(übertrag!I6,neunü,2, ),IF($H$2=10,VLOOKUP(übertrag!I6,zehnü,2, ),IF($H$2=11,VLOOKUP(übertrag!I6,elfü,2, ),IF($H$2=12,VLOOKUP(übertrag!I6,Heimü,2, ),\"\"))))))","v":""},{"$f":"IF(übertrag!$H$2=1,VLOOKUP(übertrag!I6,jhg1,2, ),IF($H$2=2,VLOOKUP(übertrag!I6,jhg2,2, ),IF($H$2=3,VLOOKUP(übertrag!I6,jhg3,2, ),IF($H$2=4,VLOOKUP(übertrag!I6,jhg4,2, ),IF($H$2=5,VLOOKUP(übertrag!I6,jhg5,2, ),IF($H$2=6,VLOOKUP(übertrag!I6,jhg6,2, ),\"\"))))))","v":{"$error":"#NAME?"}},{"$f":"IF(übertrag!$H$2=7,VLOOKUP(übertrag!I6,jhg7,2, ),IF($H$2=8,VLOOKUP(übertrag!I6,jhg8,2, ),IF($H$2=9,VLOOKUP(übertrag!I6,jhg9,2, ),IF($H$2=10,VLOOKUP(übertrag!I6,jhg10,2, ),IF($H$2=11,VLOOKUP(übertrag!I6,jhg11,2, ),IF($H$2=12,VLOOKUP(übertrag!I6,jhgheim,2, ),\"\"))))))","v":""},{"$f":"IF(übertrag!$H$2=1,VLOOKUP(übertrag!I6,paß1,2, ),IF($H$2=2,VLOOKUP(übertrag!I6,paß2,2, ),IF($H$2=3,VLOOKUP(übertrag!I6,paß3,2, ),IF($H$2=4,VLOOKUP(übertrag!I6,paß4,2, ),IF($H$2=5,VLOOKUP(übertrag!I6,paß5,2, ),IF($H$2=6,VLOOKUP(übertrag!I6,paß6,2, ),\"\"))))))","v":0},{"$f":"IF(übertrag!$H$2=7,VLOOKUP(übertrag!I6,paß7,2, ),IF($H$2=8,VLOOKUP(übertrag!I6,paß8,2, ),IF($H$2=9,VLOOKUP(übertrag!I6,paß9,2, ),IF($H$2=10,VLOOKUP(übertrag!I6,paß10,2, ),IF($H$2=11,VLOOKUP(übertrag!I6,paß11,2, ),IF($H$2=12,VLOOKUP(übertrag!I6,paßheim,2, ),\"\"))))))","v":""},{"$f":"FALSE()","v":0},null,null,null,5,{"$f":"'MANNSCHAFTEN+SPIELER'!A87","v":"Kegelfreunde Dresden 2."},null,null,null,{"$f":"IF(I20,VLOOKUP(übertrag!I20,Heimü,2, ),\"\")","v":"Tobias Spille"},null,null,null,null,5]
[13,1,null,13,null,null,null,null,7,null,{"$f":"IF(übertrag!$H$2=1,VLOOKUP(übertrag!I7,einsü,2, ),IF($H$2=2,VLOOKUP(übertrag!I7,zweiü,2, ),IF($H$2=3,VLOOKUP(übertrag!I7,dreiü,2, ),IF($H$2=4,VLOOKUP(übertrag!I7,vierü,2, ),IF($H$2=5,VLOOKUP(übertrag!I7,fünfü,2, ),IF($H$2=6,VLOOKUP(übertrag!I7,sechsü,2, ),\"\"))))))","v":"Robert Nake"},{"$f":"IF(übertrag!$H$2=7,VLOOKUP(übertrag!I7,siebenü,2, ),IF($H$2=8,VLOOKUP(übertrag!I7,achtü,2, ),IF($H$2=9,VLOOKUP(übertrag!I7,neunü,2, ),IF($H$2=10,VLOOKUP(übertrag!I7,zehnü,2, ),IF($H$2=11,VLOOKUP(übertrag!I7,elfü,2, ),IF($H$2=12,VLOOKUP(übertrag!I7,Heimü,2, ),\"\"))))))","v":""},{"$f":"IF(übertrag!$H$2=1,VLOOKUP(übertrag!I7,jhg1,2, ),IF($H$2=2,VLOOKUP(übertrag!I7,jhg2,2, ),IF($H$2=3,VLOOKUP(übertrag!I7,jhg3,2, ),IF($H$2=4,VLOOKUP(übertrag!I7,jhg4,2, ),IF($H$2=5,VLOOKUP(übertrag!I7,jhg5,2, ),IF($H$2=6,VLOOKUP(übertrag!I7,jhg6,2, ),\"\"))))))","v":{"$error":"#NAME?"}},{"$f":"IF(übertrag!$H$2=7,VLOOKUP(übertrag!I7,jhg7,2, ),IF($H$2=8,VLOOKUP(übertrag!I7,jhg8,2, ),IF($H$2=9,VLOOKUP(übertrag!I7,jhg9,2, ),IF($H$2=10,VLOOKUP(übertrag!I7,jhg10,2, ),IF($H$2=11,VLOOKUP(übertrag!I7,jhg11,2, ),IF($H$2=12,VLOOKUP(übertrag!I7,jhgheim,2, ),\"\"))))))","v":""},{"$f":"IF(übertrag!$H$2=1,VLOOKUP(übertrag!I7,paß1,2, ),IF($H$2=2,VLOOKUP(übertrag!I7,paß2,2, ),IF($H$2=3,VLOOKUP(übertrag!I7,paß3,2, ),IF($H$2=4,VLOOKUP(übertrag!I7,paß4,2, ),IF($H$2=5,VLOOKUP(übertrag!I7,paß5,2, ),IF($H$2=6,VLOOKUP(übertrag!I7,paß6,2, ),\"\"))))))","v":0},{"$f":"IF(übertrag!$H$2=7,VLOOKUP(übertrag!I7,paß7,2, ),IF($H$2=8,VLOOKUP(übertrag!I7,paß8,2, ),IF($H$2=9,VLOOKUP(übertrag!I7,paß9,2, ),IF($H$2=10,VLOOKUP(übertrag!I7,paß10,2, ),IF($H$2=11,VLOOKUP(übertrag!I7,paß11,2, ),IF($H$2=12,VLOOKUP(übertrag!I7,paßheim,2, ),\"\"))))))","v":""},{"$f":"FALSE()","v":0},null,null,null,6,{"$f":"'MANNSCHAFTEN+SPIELER'!A108","v":"Gastmannschaft 6"},null,null,null,{"$f":"IF(I21,VLOOKUP(übertrag!I21,Heimü,2, ),\"\")","v":"Sven Peter"},null,null,null,null,6]
[13,9,9,13,null,null,null,null,1,null,{"$f":"IF(übertrag!$H$2=1,VLOOKUP(übertrag!I8,einsü,2, ),IF($H$2=2,VLOOKUP(übertrag!I8,zweiü,2, ),IF($H$2=3,VLOOKUP(übertrag!I8,dreiü,2, ),IF($H$2=4,VLOOKUP(übertrag!I8,vierü,2, ),IF($H$2=5,VLOOKUP(übertrag!I8,fünfü,2, ),IF($H$2=6,VLOOKUP(übertrag!I8,sechsü,2, ),\"\"))))))","v":0},{"$f":"IF(übertrag!$H$2=7,VLOOKUP(übertrag!I8,siebenü,2, ),IF($H$2=8,VLOOKUP(übertrag!I8,achtü,2, ),IF($H$2=9,VLOOKUP(übertrag!I8,neunü,2, ),IF($H$2=10,VLOOKUP(übertrag!I8,zehnü,2, ),IF($H$2=11,VLOOKUP(übertrag!I8,elfü,2, ),IF($H$2=12,VLOOKUP(übertrag!I8,Heimü,2, ),\"\"))))))","v":""},{"$f":"IF(übertrag!$H$2=1,VLOOKUP(übertrag!I8,jhg1,2, ),IF($H$2=2,VLOOKUP(übertrag!I8,jhg2,2, ),IF($H$2=3,VLOOKUP(übertrag!I8,jhg3,2, ),IF($H$2=4,VLOOKUP(übertrag!I8,jhg4,2, ),IF($H$2=5,VLOOKUP(übertrag!I8,jhg5,2, ),IF($H$2=6,VLOOKUP(übertrag!I8,jhg6,2, ),\"\"))))))","v":{"$error":"#NAME?"}},{"$f":"IF(übertrag!$H$2=7,VLOOKUP(übertrag!I8,jhg7,2, ),IF($H$2=8,VLOOKUP(übertrag!I8,jhg8,2, ),IF($H$2=9,VLOOKUP(übertrag!I8,jhg9,2, ),IF($H$2=10,VLOOKUP(übertrag!I8,jhg10,2, ),IF($H$2=11,VLOOKUP(übertrag!I8,jhg11,2, ),IF($H$2=12,VLOOKUP(übertrag!I8,jhgheim,2, ),\"\"))))))","v":""},{"$f":"IF(übertrag!$H$2=1,VLOOKUP(übertrag!I8,paß1,2, ),IF($H$2=2,VLOOKUP(übertrag!I8,paß2,2, ),IF($H$2=3,VLOOKUP(übertrag!I8,paß3,2, ),IF($H$2=4,VLOOKUP(übertrag!I8,paß4,2, ),IF($H$2=5,VLOOKUP(übertrag!I8,paß5,2, ),IF($H$2=6,VLOOKUP(übertrag!I8,paß6,2, ),\"\"))))))","v":0},{"$f":"IF(übertrag!$H$2=7,VLOOKUP(übertrag!I8,paß7,2, ),IF($H$2=8,VLOOKUP(übertrag!I8,paß8,2, ),IF($H$2=9,VLOOKUP(übertrag!I8,paß9,2, ),IF($H$2=10,VLOOKUP(übertrag!I8,paß10,2, ),IF($H$2=11,VLOOKUP(übertrag!I8,paß11,2, ),IF($H$2=12,VLOOKUP(übertrag!I8,paßheim,2, ),\"\"))))))","v":""},{"$f":"FALSE()","v":0},null,null,null,7,{"$f":"'MANNSCHAFTEN+SPIELER'!A129","v":"Gastmannschaft 7"},null,null,null,{"$f":"IF(I22,VLOOKUP(übertrag!I22,Heimü,2, ),\"\")","v":0},null,null,null,null,7]
[null,null,null,null,null,null,null,null,1,null,{"$f":"IF(übertrag!$H$2=1,VLOOKUP(übertrag!I9,einsü,2, ),IF($H$2=2,VLOOKUP(übertrag!I9,zweiü,2, ),IF($H$2=3,VLOOKUP(übertrag!I9,dreiü,2, ),IF($H$2=4,VLOOKUP(übertrag!I9,vierü,2, ),IF($H$2=5,VLOOKUP(übertrag!I9,fünfü,2, ),IF($H$2=6,VLOOKUP(übertrag!I9,sechsü,2, ),\"\"))))))","v":0},{"$f":"IF(übertrag!$H$2=7,VLOOKUP(übertrag!I9,siebenü,2, ),IF($H$2=8,VLOOKUP(übertrag!I9,achtü,2, ),IF($H$2=9,VLOOKUP(übertrag!I9,neunü,2, ),IF($H$2=10,VLOOKUP(übertrag!I9,zehnü,2, ),IF($H$2=11,VLOOKUP(übertrag!I9,elfü,2, ),IF($H$2=12,VLOOKUP(übertrag!I9,Heimü,2, ),\"\"))))))","v":""},{"$f":"IF(übertrag!$H$2=1,VLOOKUP(übertrag!I9,jhg1,2, ),IF($H$2=2,VLOOKUP(übertrag!I9,jhg2,2, ),IF($H$2=3,VLOOKUP(übertrag!I9,jhg3,2, ),IF($H$2=4,VLOOKUP(übertrag!I9,jhg4,2, ),IF($H$2=5,VLOOKUP(übertrag!I9,jhg5,2, ),IF($H$2=6,VLOOKUP(übertrag!I9,jhg6,2, ),\"\"))))))","v":{"$error":"#NAME?"}},{"$f":"IF(übertrag!$H$2=7,VLOOKUP(übertrag!I9,jhg7,2, ),IF($H$2=8,VLOOKUP(übertrag!I9,jhg8,2, ),IF($H$2=9,VLOOKUP(übertrag!I9,jhg9,2, ),IF($H$2=10,VLOOKUP(übertrag!I9,jhg10,2, ),IF($H$2=11,VLOOKUP(übertrag!I9,jhg11,2, ),IF($H$2=12,VLOOKUP(übertrag!I9,jhgheim,2, ),\"\"))))))","v":""},{"$f":"IF(übertrag!$H$2=1,VLOOKUP(übertrag!I9,paß1,2, ),IF($H$2=2,VLOOKUP(übertrag!I9,paß2,2, ),IF($H$2=3,VLOOKUP(übertrag!I9,paß3,2, ),IF($H$2=4,VLOOKUP(übertrag!I9,paß4,2, ),IF($H$2=5,VLOOKUP(übertrag!I9,paß5,2, ),IF($H$2=6,VLOOKUP(übertrag!I9,paß6,2, ),\"\"))))))","v":0},{"$f":"IF(übertrag!$H$2=7,VLOOKUP(übertrag!I9,paß7,2, ),IF($H$2=8,VLOOKUP(übertrag!I9,paß8,2, ),IF($H$2=9,VLOOKUP(übertrag!I9,paß9,2, ),IF($H$2=10,VLOOKUP(übertrag!I9,paß10,2, ),IF($H$2=11,VLOOKUP(übertrag!I9,paß11,2, ),IF($H$2=12,VLOOKUP(übertrag!I9,paßheim,2, ),\"\"))))))","v":""},{"$f":"FALSE()","v":0},null,null,null,8,{"$f":"'MANNSCHAFTEN+SPIELER'!A150","v":"Gastmannschaft 8"},null,null,null,{"$f":"IF(I23,VLOOKUP(übertrag!I23,Heimü,2, ),\"\")","v":0},null,null,null,null,8]
[null,9,9,null,null,null,null,null,1,null,{"$f":"IF(übertrag!$H$2=1,VLOOKUP(übertrag!I10,einsü,2, ),IF($H$2=2,VLOOKUP(übertrag!I10,zweiü,2, ),IF($H$2=3,VLOOKUP(übertrag!I10,dreiü,2, ),IF($H$2=4,VLOOKUP(übertrag!I10,vierü,2, ),IF($H$2=5,VLOOKUP(übertrag!I10,fünfü,2, ),IF($H$2=6,VLOOKUP(übertrag!I10,sechsü,2, ),\"\"))))))","v":0},{"$f":"IF(übertrag!$H$2=7,VLOOKUP(übertrag!I10,siebenü,2, ),IF($H$2=8,VLOOKUP(übertrag!I10,achtü,2, ),IF($H$2=9,VLOOKUP(übertrag!I10,neunü,2, ),IF($H$2=10,VLOOKUP(übertrag!I10,zehnü,2, ),IF($H$2=11,VLOOKUP(übertrag!I10,elfü,2, ),IF($H$2=12,VLOOKUP(übertrag!I10,Heimü,2, ),\"\"))))))","v":""},{"$f":"IF(übertrag!$H$2=1,VLOOKUP(übertrag!I10,jhg1,2, ),IF($H$2=2,VLOOKUP(übertrag!I10,jhg2,2, ),IF($H$2=3,VLOOKUP(übertrag!I10,jhg3,2, ),IF($H$2=4,VLOOKUP(übertrag!I10,jhg4,2, ),IF($H$2=5,VLOOKUP(übertrag!I10,jhg5,2, ),IF($H$2=6,VLOOKUP(übertrag!I10,jhg6,2, ),\"\"))))))","v":{"$error":"#NAME?"}},{"$f":"IF(übertrag!$H$2=7,VLOOKUP(übertrag!I10,jhg7,2, ),IF($H$2=8,VLOOKUP(übertrag!I10,jhg8,2, ),IF($H$2=9,VLOOKUP(übertrag!I10,jhg9,2, ),IF($H$2=10,VLOOKUP(übertrag!I10,jhg10,2, ),IF($H$2=11,VLOOKUP(übertrag!I10,jhg11,2, ),IF($H$2=12,VLOOKUP(übertrag!I10,jhgheim,2, ),\"\"))))))","v":""},{"$f":"IF(übertrag!$H$2=1,VLOOKUP(übertrag!I10,paß1,2, ),IF($H$2=2,VLOOKUP(übertrag!I10,paß2,2, ),IF($H$2=3,VLOOKUP(übertrag!I10,paß3,2, ),IF($H$2=4,VLOOKUP(übertrag!I10,paß4,2, ),IF($H$2=5,VLOOKUP(übertrag!I10,paß5,2, ),IF($H$2=6,VLOOKUP(übertrag!I10,paß6,2, ),\"\"))))))","v":0},{"$f":"IF(übertrag!$H$2=7,VLOOKUP(übertrag!I10,paß7,2, ),IF($H$2=8,VLOOKUP(übertrag!I10,paß8,2, ),IF($H$2=9,VLOOKUP(übertrag!I10,paß9,2, ),IF($H$2=10,VLOOKUP(übertrag!I10,paß10,2, ),IF($H$2=11,VLOOKUP(übertrag!I10,paß11,2, ),IF($H$2=12,VLOOKUP(übertrag!I10,paßheim,2, ),\"\"))))))","v":""},{"$f":"FALSE()","v":0},null,null,null,9,{"$f":"'MANNSCHAFTEN+SPIELER'!A171","v":"Gastmannschaft 9"},null,null,null,{"$f":"IF(I24,VLOOKUP(übertrag!I24,Heimü,2, ),\"\")","v":0},null,null,null,null,9]
[null,null,null,null,null,null,null,null,1,null,{"$f":"IF(übertrag!$H$2=1,VLOOKUP(übertrag!I11,einsü,2, ),IF($H$2=2,VLOOKUP(übertrag!I11,zweiü,2, ),IF($H$2=3,VLOOKUP(übertrag!I11,dreiü,2, ),IF($H$2=4,VLOOKUP(übertrag!I11,vierü,2, ),IF($H$2=5,VLOOKUP(übertrag!I11,fünfü,2, ),IF($H$2=6,VLOOKUP(übertrag!I11,sechsü,2, ),\"\"))))))","v":0},{"$f":"IF(übertrag!$H$2=7,VLOOKUP(übertrag!I11,siebenü,2, ),IF($H$2=8,VLOOKUP(übertrag!I11,achtü,2, ),IF($H$2=9,VLOOKUP(übertrag!I11,neunü,2, ),IF($H$2=10,VLOOKUP(übertrag!I11,zehnü,2, ),IF($H$2=11,VLOOKUP(übertrag!I11,elfü,2, ),IF($H$2=12,VLOOKUP(übertrag!I11,Heimü,2, ),\"\"))))))","v":""},{"$f":"IF(übertrag!$H$2=1,VLOOKUP(übertrag!I11,jhg1,2, ),IF($H$2=2,VLOOKUP(übertrag!I11,jhg2,2, ),IF($H$2=3,VLOOKUP(übertrag!I11,jhg3,2, ),IF($H$2=4,VLOOKUP(übertrag!I11,jhg4,2, ),IF($H$2=5,VLOOKUP(übertrag!I11,jhg5,2, ),IF($H$2=6,VLOOKUP(übertrag!I11,jhg6,2, ),\"\"))))))","v":{"$error":"#NAME?"}},{"$f":"IF(übertrag!$H$2=7,VLOOKUP(übertrag!I11,jhg7,2, ),IF($H$2=8,VLOOKUP(übertrag!I11,jhg8,2, ),IF($H$2=9,VLOOKUP(übertrag!I11,jhg9,2, ),IF($H$2=10,VLOOKUP(übertrag!I11,jhg10,2, ),IF($H$2=11,VLOOKUP(übertrag!I11,jhg11,2, ),IF($H$2=12,VLOOKUP(übertrag!I11,jhgheim,2, ),\"\"))))))","v":""},{"$f":"IF(übertrag!$H$2=1,VLOOKUP(übertrag!I11,paß1,2, ),IF($H$2=2,VLOOKUP(übertrag!I11,paß2,2, ),IF($H$2=3,VLOOKUP(übertrag!I11,paß3,2, ),IF($H$2=4,VLOOKUP(übertrag!I11,paß4,2, ),IF($H$2=5,VLOOKUP(übertrag!I11,paß5,2, ),IF($H$2=6,VLOOKUP(übertrag!I11,paß6,2, ),\"\"))))))","v":0},{"$f":"IF(übertrag!$H$2=7,VLOOKUP(übertrag!I11,paß7,2, ),IF($H$2=8,VLOOKUP(übertrag!I11,paß8,2, ),IF($H$2=9,VLOOKUP(übertrag!I11,paß9,2, ),IF($H$2=10,VLOOKUP(übertrag!I11,paß10,2, ),IF($H$2=11,VLOOKUP(übertrag!I11,paß11,2, ),IF($H$2=12,VLOOKUP(übertrag!I11,paßheim,2, ),\"\"))))))","v":""},{"$f":"FALSE()","v":0},null,null,null,10,{"$f":"'MANNSCHAFTEN+SPIELER'!A192","v":"Gastmannschaft 10"},null,null,null,{"$f":"IF(I25,VLOOKUP(übertrag!I25,Heimü,2, ),\"\")","v":0},null,null,null,null,10]
[null,null,null,null,null,null,null,null,1,null,{"$f":"IF(übertrag!$H$2=1,VLOOKUP(übertrag!I12,einsü,2, ),IF($H$2=2,VLOOKUP(übertrag!I12,zweiü,2, ),IF($H$2=3,VLOOKUP(übertrag!I12,dreiü,2, ),IF($H$2=4,VLOOKUP(übertrag!I12,vierü,2, ),IF($H$2=5,VLOOKUP(übertrag!I12,fünfü,2, ),IF($H$2=6,VLOOKUP(übertrag!I12,sechsü,2, ),\"\"))))))","v":0},{"$f":"IF(übertrag!$H$2=7,VLOOKUP(übertrag!I12,siebenü,2, ),IF($H$2=8,VLOOKUP(übertrag!I12,achtü,2, ),IF($H$2=9,VLOOKUP(übertrag!I12,neunü,2, ),IF($H$2=10,VLOOKUP(übertrag!I12,zehnü,2, ),IF($H$2=11,VLOOKUP(übertrag!I12,elfü,2, ),IF($H$2=12,VLOOKUP(übertrag!I12,Heimü,2, ),\"\"))))))","v":""},{"$f":"IF(übertrag!$H$2=1,VLOOKUP(übertrag!I12,jhg1,2, ),IF($H$2=2,VLOOKUP(übertrag!I12,jhg2,2, ),IF($H$2=3,VLOOKUP(übertrag!I12,jhg3,2, ),IF($H$2=4,VLOOKUP(übertrag!I12,jhg4,2, ),IF($H$2=5,VLOOKUP(übertrag!I12,jhg5,2, ),IF($H$2=6,VLOOKUP(übertrag!I12,jhg6,2, ),\"\"))))))","v":{"$error":"#NAME?"}},{"$f":"IF(übertrag!$H$2=7,VLOOKUP(übertrag!I12,jhg7,2, ),IF($H$2=8,VLOOKUP(übertrag!I12,jhg8,2, ),IF($H$2=9,VLOOKUP(übertrag!I12,jhg9,2, ),IF($H$2=10,VLOOKUP(übertrag!I12,jhg10,2, ),IF($H$2=11,VLOOKUP(übertrag!I12,jhg11,2, ),IF($H$2=12,VLOOKUP(übertrag!I12,jhgheim,2, ),\"\"))))))","v":""},{"$f":"IF(übertrag!$H$2=1,VLOOKUP(übertrag!I12,paß1,2, ),IF($H$2=2,VLOOKUP(übertrag!I12,paß2,2, ),IF($H$2=3,VLOOKUP(übertrag!I12,paß3,2, ),IF($H$2=4,VLOOKUP(übertrag!I12,paß4,2, ),IF($H$2=5,VLOOKUP(übertrag!I12,paß5,2, ),IF($H$2=6,VLOOKUP(übertrag!I12,paß6,2, ),\"\"))))))","v":0},{"$f":"IF(übertrag!$H$2=7,VLOOKUP(übertrag!I12,paß7,2, ),IF($H$2=8,VLOOKUP(übertrag!I12,paß8,2, ),IF($H$2=9,VLOOKUP(übertrag!I12,paß9,2, ),IF($H$2=10,VLOOKUP(übertrag!I12,paß10,2, ),IF($H$2=11,VLOOKUP(übertrag!I12,paß11,2, ),IF($H$2=12,VLOOKUP(übertrag!I12,paßheim,2, ),\"\"))))))","v":""},null,null,null,null,11,{"$f":"'MANNSCHAFTEN+SPIELER'!A213","v":"Gastmannschaft 11"},null,null,null,{"$f":"IF(I26,VLOOKUP(übertrag!I26,Heimü,2, ),\"\")","v":0},null,null,null,null,11]
[null,null,null,null,null,null,null,null,1,null,{"$f":"IF(übertrag!$H$2=1,VLOOKUP(übertrag!I13,einsü,2, ),IF($H$2=2,VLOOKUP(übertrag!I13,zweiü,2, ),IF($H$2=3,VLOOKUP(übertrag!I13,dreiü,2, ),IF($H$2=4,VLOOKUP(übertrag!I13,vierü,2, ),IF($H$2=5,VLOOKUP(übertrag!I13,fünfü,2, ),IF($H$2=6,VLOOKUP(übertrag!I13,sechsü,2, ),\"\"))))))","v":0},{"$f":"IF(übertrag!$H$2=7,VLOOKUP(übertrag!I13,siebenü,2, ),IF($H$2=8,VLOOKUP(übertrag!I13,achtü,2, ),IF($H$2=9,VLOOKUP(übertrag!I13,neunü,2, ),IF($H$2=10,VLOOKUP(übertrag!I13,zehnü,2, ),IF($H$2=11,VLOOKUP(übertrag!I13,elfü,2, ),IF($H$2=12,VLOOKUP(übertrag!I13,Heimü,2, ),\"\"))))))","v":""},{"$f":"IF(übertrag!$H$2=1,VLOOKUP(übertrag!I13,jhg1,2, ),IF($H$2=2,VLOOKUP(übertrag!I13,jhg2,2, ),IF($H$2=3,VLOOKUP(übertrag!I13,jhg3,2, ),IF($H$2=4,VLOOKUP(übertrag!I13,jhg4,2, ),IF($H$2=5,VLOOKUP(übertrag!I13,jhg5,2, ),IF($H$2=6,VLOOKUP(übertrag!I13,jhg6,2, ),\"\"))))))","v":{"$error":"#NAME?"}},{"$f":"IF(übertrag!$H$2=7,VLOOKUP(übertrag!I13,jhg7,2, ),IF($H$2=8,VLOOKUP(übertrag!I13,jhg8,2, ),IF($H$2=9,VLOOKUP(übertrag!I13,jhg9,2, ),IF($H$2=10,VLOOKUP(übertrag!I13,jhg10,2, ),IF($H$2=11,VLOOKUP(übertrag!I13,jhg11,2, ),IF($H$2=12,VLOOKUP(übertrag!I13,jhgheim,2, ),\"\"))))))","v":""},{"$f":"IF(übertrag!$H$2=1,VLOOKUP(übertrag!I13,paß1,2, ),IF($H$2=2,VLOOKUP(übertrag!I13,paß2,2, ),IF($H$2=3,VLOOKUP(übertrag!I13,paß3,2, ),IF($H$2=4,VLOOKUP(übertrag!I13,paß4,2, ),IF($H$2=5,VLOOKUP(übertrag!I13,paß5,2, ),IF($H$2=6,VLOOKUP(übertrag!I13,paß6,2, ),\"\"))))))","v":0},{"$f":"IF(übertrag!$H$2=7,VLOOKUP(übertrag!I13,paß7,2, ),IF($H$2=8,VLOOKUP(übertrag!I13,paß8,2, ),IF($H$2=9,VLOOKUP(übertrag!I13,paß9,2, ),IF($H$2=10,VLOOKUP(übertrag!I13,paß10,2, ),IF($H$2=11,VLOOKUP(übertrag!I13,paß11,2, ),IF($H$2=12,VLOOKUP(übertrag!I13,paßheim,2, ),\"\"))))))","v":""},null,null,null,null,12,{"$f":"'MANNSCHAFTEN+SPIELER'!O3","v":"Königswarthaer SV"},null,null,null,{"$f":"IF(I27,VLOOKUP(übertrag!I27,Heimü,2, ),\"\")","v":0},null,null,null,null,12]
[null,null,null,null,null,null,null,null,10,null,null,null,null,null,null,null,null,null,null,null,13,null,null,null,null,{"$f":"IF(I28,VLOOKUP(übertrag!I28,Heimü,2, ),\"\")","v":0},null,null,null,null,13]
[null,null,null,null,null,null,null,null,null,null,null,null,null,null,null,null,null,null,null,null,14,null,null,null,null,{"$f":"IF(I29,VLOOKUP(übertrag!I29,Heimü,2, ),\"\")","v":0},null,null,null,null,14]
[null,null,null,null,null,null,null,null,2,null,{"$f":"IF(I16,VLOOKUP(übertrag!I16,paßheim,2, ),\"\")","v":12345},null,{"$f":"IF(I16,VLOOKUP(übertrag!I16,jhgheim,2, ),\"\")","v":"1900-02-02"},null,{"$f":"IF(übertrag!I16,VLOOKUP(übertrag!I16,paßheim,2, ),\"\")","v":12345},null,{"$f":"FALSE()","v":0},null,null,null,null,null,null,null,null,{"$f":"IF(I25,VLOOKUP(übertrag!I25,Heimü,2, ),\"\")","v":0},null,null,null,null,15]
[null,9,9,null,null,null,null,null,3,null,{"$f":"IF(I17,VLOOKUP(übertrag!I17,paßheim,2, ),\"\")","v":23456},null,{"$f":"IF(I17,VLOOKUP(übertrag!I17,jhgheim,2, ),\"\")","v":"1900-02-13"},null,{"$f":"IF(übertrag!I17,VLOOKUP(übertrag!I17,paßheim,2, ),\"\")","v":23456},null,{"$f":"FALSE()","v":0},null,null,null,null,null,null,null,null,{"$f":"IF(I26,VLOOKUP(übertrag!I26,Heimü,2, ),\"\")","v":0},null,null,null,null,16]
[null,1,null,null,null,null,null,null,4,null,{"$f":"IF(I18,VLOOKUP(übertrag!I18,paßheim,2, ),\"\")","v":34567},null,{"$f":"IF(I18,VLOOKUP(übertrag!I18,jhgheim,2, ),\"\")","v":"1900-01-22"},null,{"$f":"IF(übertrag!I18,VLOOKUP(übertrag!I18,paßheim,2, ),\"\")","v":34567},null,{"$f":"FALSE()","v":0},null,null,null,null,null,null,null,null,{"$f":"IF(I27,VLOOKUP(übertrag!I27,Heimü,2, ),\"\")","v":0},null,null,null,null,17]
[null,9,9,null,null,null,null,null,5,null,{"$f":"IF(I19,VLOOKUP(übertrag!I19,paßheim,2, ),\"\")","v":45678},null,{"$f":"IF(I19,VLOOKUP(übertrag!I19,jhgheim,2, ),\"\")","v":"1900-01-11"},null,{"$f":"IF(übertrag!I19,VLOOKUP(übertrag!I19,paßheim,2, ),\"\")","v":45678},null,{"$f":"FALSE()","v":0},null,null,null,null,null,null,null,null,null,null,null,null,null,18]
[null,null,null,null,null,null,null,null,6,null,{"$f":"IF(I20,VLOOKUP(übertrag!I20,paßheim,2, ),\"\")","v":56789},null,{"$f":"IF(I20,VLOOKUP(übertrag!I20,jhgheim,2, ),\"\")","v":"1900-02-02"},null,{"$f":"IF(übertrag!I20,VLOOKUP(übertrag!I20,paßheim,2, ),\"\")","v":56789},null,{"$f":"FALSE()","v":0},null,null,null,null,null,null,null,null,null,null,null,null,null,19]
[null,null,null,null,null,null,null,null,7,null,{"$f":"IF(I21,VLOOKUP(übertrag!I21,paßheim,2, ),\"\")","v":67890},null,{"$f":"IF(I21,VLOOKUP(übertrag!I21,jhgheim,2, ),\"\")","v":"1900-02-13"},null,{"$f":"IF(übertrag!I21,VLOOKUP(übertrag!I21,paßheim,2, ),\"\")","v":67890},null,{"$f":"FALSE()","v":0},null,null,null,null,null,null,null,null,null,null,null,null,null,20]
[null,null,null,null,null,null,null,null,8,null,{"$f":"IF(I22,VLOOKUP(übertrag!I22,paßheim,2, ),\"\")","v":0},null,{"$f":"IF(I22,VLOOKUP(übertrag!I22,jhgheim,2, ),\"\")","v":"00:00:00"},null,{"$f":"IF(übertrag!I22,VLOOKUP(übertrag!I22,paßheim,2, ),\"\")","v":0},null,{"$f":"FALSE()","v":0},null,null,null,null,null,null,null,null,null,null,null,null,null,21]
[null,null,null,null,null,null,null,null,1,null,{"$f":"IF(I23,VLOOKUP(übertrag!I23,paßheim,2, ),\"\")","v":0},null,{"$f":"IF(I23,VLOOKUP(übertrag!I23,jhgheim,2, ),\"\")","v":"00:00:00"},null,{"$f":"IF(übertrag!I23,VLOOKUP(übertrag!I23,paßheim,2, ),\"\")","v":0},null,{"$f":"FALSE()","v":0},null,null,null,null,null,null,null,null,null,null,null,null,null,22]
[null,null,null,null,null,null,null,null,1,null,{"$f":"IF(I24,VLOOKUP(übertrag!I24,paßheim,2, ),\"\")","v":0},null,{"$f":"IF(I24,VLOOKUP(übertrag!I24,jhgheim,2, ),\"\")","v":"00:00:00"},null,{"$f":"IF(übertrag!I24,VLOOKUP(übertrag!I24,paßheim,2, ),\"\")","v":0},null,{"$f":"FALSE()","v":0}]
[null,null,null,null,null,null,null,null,1,null,{"$f":"IF(I25,VLOOKUP(übertrag!I25,paßheim,2, ),\"\")","v":0},null,{"$f":"IF(I25,VLOOKUP(übertrag!I25,jhgheim,2, ),\"\")","v":"00:00:00"},null,{"$f":"IF(übertrag!I25,VLOOKUP(übertrag!I25,paßheim,2, ),\"\")","v":0},null,{"$f":"FALSE()","v":0},null,null,null,null,null,null,null,null,null,null,null,null,null,23]
[null,null,null,null,null,null,null,null,1,null,{"$f":"IF(I26,VLOOKUP(übertrag!I26,paßheim,2, ),\"\")","v":0},null,{"$f":"IF(I26,VLOOKUP(übertrag!I26,jhgheim,2, ),\"\")","v":"00:00:00"},null,{"$f":"IF(übertrag!I26,VLOOKUP(übertrag!I26,paßheim,2, ),\"\")","v":0},null,{"$f":"FALSE()","v":0}]
[null,null,null,null,null,null,null,null,1,null,{"$f":"IF(I27,VLOOKUP(übertrag!I27,paßheim,2, ),\"\")","v":0},null,{"$f":"IF(I27,VLOOKUP(übertrag!I27,jhgheim,2, ),\"\")","v":"00:00:00"},null,{"$f":"IF(übertrag!I27,VLOOKUP(übertrag!I27,paßheim,2, ),\"\")","v":0},null,{"$f":"FALSE()","v":0}]
[null,null,null,null,null,null,null,null,1,null,{"$f":"IF(I28,VLOOKUP(übertrag!I28,paßheim,2, ),\"\")","v":0},null,{"$f":"IF(I28,VLOOKUP(übertrag!I28,jhgheim,2, ),\"\")","v":"00:00:00"},null,{"$f":"IF(übertrag!I28,VLOOKUP(übertrag!I28,paßheim,2, ),\"\")","v":0},null,{"$f":"FALSE()","v":0}]
[null,null,null,null,null,null,null,null,13,null,null,null,{"$f":"IF(I29,VLOOKUP(übertrag!I29,jhgheim,2, ),\"\")","v":"00:00:00"},null,{"$f":"IF(übertrag!I29,VLOOKUP(übertrag!I29,paßheim,2, ),\"\")","v":0},null,{"$f":"FALSE()","v":0}]
[null,null,null,null,null,null,null,null,null,null,null,null,{"$f":"IF(I30,VLOOKUP(übertrag!I30,jhgheim,2, ),\"\")","v":""},null,{"$f":"IF(übertrag!I30,VLOOKUP(übertrag!I30,paßheim,2, ),\"\")","v":""},null,{"$f":"FALSE()","v":0}]
[null,null,null,null,null,null,null,null,null,null,null,null,{"$f":"IF(I31,VLOOKUP(übertrag!I31,jhgheim,2, ),\"\")","v":""},null,{"$f":"IF(übertrag!I31,VLOOKUP(übertrag!I31,paßheim,2, ),\"\")","v":""},null,{"$f":"FALSE()","v":0}]
[null,null,null,null,null,null,null,null,null,null,null,null,{"$f":"IF(I32,VLOOKUP(übertrag!I32,jhgheim,2, ),\"\")","v":""},null,{"$f":"IF(übertrag!I32,VLOOKUP(übertrag!I32,paßheim,2, ),\"\")","v":""},null,{"$f":"FALSE()","v":0}]
[null,null,null,null,null,null,null,null,null,null,null,null,{"$f":"IF(I33,VLOOKUP(übertrag!I33,jhgheim,2, ),\"\")","v":""},null,{"$f":"IF(übertrag!I33,VLOOKUP(übertrag!I33,paßheim,2, ),\"\")","v":""},null,{"$f":"FALSE()","v":0}]
[]
[]
[]
[]
[]
[]
[]
[]
[]
[]
[]
[]
[]
[]
[]
[]
[null,null,null,null,null,null,null,null,null,null,null,null,null,null,null,null,{"$f":"FALSE()","v":0}]
[null,null,null,null,null,null,null,null,null,null,null,null,null,null,null,null,{"$f":"FALSE()","v":0}]
[null,null,null,null,null,null,null,null,null,null,null,null,null,null,null,null,{"$f":"FALSE()","v":0}]
[null,null,null,null,null,null,null,null,null,null,null,null,null,null,null,null,{"$f":"FALSE()","v":0}]
[null,null,null,null,null,null,null,null,null,null,null,null,null,null,null,null,{"$f":"FALSE()","v":0}]
[null,null,null,null,null,null,null,null,null,null,null,null,null,null,null,null,{"$f":"FALSE()","v":0}]
[null,null,null,null,null,null,null,null,null,null,null,null,null,null,null,null,{"$f":"FALSE()","v":0}]
[null,null,null,null,null,null,null,null,null,null,null,null,null,null,null,null,{"$f":"FALSE()","v":0}]
[null,null,null,null,null,null,null,null,null,null,null,null,null,null,null,null,{"$f":"FALSE()","v":0}]
[null,null,null,null,null,null,null,null,null,null,null,null,null,null,null,null,{"$f":"FALSE()","v":0}]
[null,null,null,null,null,null,null,null,null,null,null,null,null,null,null,null,{"$f":"FALSE()","v":0}]