{"text_format":"1","workbook":"xlsx","n_sheets":8,"sheets":["DKB","Einzelergebnisse","MANNSCHAFTEN+SPIELER","Beamer_1","Dialog","Dialog2","Dialog3","übertrag"],"not_rendered":{"charts":0,"images":1,"macros":1,"external_links":0,"defined_names":48,"comments":1,"pivot_tables":0},"unopened":[],"bounds":{"document_bytes":16777216,"sheet_cells":100000,"rows_first":2000,"rows_last":500,"rows_between":2000,"halvings":0,"cell_chars":16384,"cell_head_chars":4096},"cells_cut":0,"cells_raw":0,"read":"whole","date_system":"1900"}

{"sheet":"DKB","index":0,"n_rows":68,"n_cols":25,"rows_kept":68,"cut":false,"hidden":false,"merged":[[0,6,0,16],[1,13,1,14],[1,15,1,24],[2,15,2,17],[2,21,2,24],[3,13,3,14],[3,15,3,24],[4,13,4,14],[4,15,4,17],[4,21,4,24],[5,13,5,14],[5,15,5,24],[6,11,6,13],[7,3,7,10],[7,11,7,13],[7,17,7,24],[9,1,9,3],[9,7,9,8],[9,15,9,17],[9,21,9,22],[10,1,11,3],[10,7,10,8],[10,10,14,10],[10,15,11,17],[10,21,10,22],[10,24,14,24],[11,7,11,8],[11,21,11,22],[12,1,12,3],[12,7,12,8],[12,15,12,17],[12,21,12,22],[13,1,14,3],[13,7,13,8],[13,15,14,17],[13,21,13,22],[14,7,14,8],[14,21,14,22],[15,7,15,8],[15,21,15,22],[16,1,16,3],[16,7,16,8],[16,15,16,17],[16,21,16,22],[17,1,18,3],[17,7,17,8],[17,10,21,10],[17,15,18,17],[17,21,17,22],[17,24,21,24],[18,7,18,8],[18,21,18,22],[19,1,19,3],[19,7,19,8],[19,15,19,17],[19,21,19,22],[20,1,21,3],[20,7,20,8],[20,15,21,17],[20,21,20,22],[21,7,21,8],[21,21,21,22],[22,7,22,8],[22,21,22,22],[23,1,23,3],[23,7,23,8],[23,15,23,17],[23,21,23,22],[24,1,25,3],[24,7,24,8],[24,10,28,10],[24,15,25,17],[24,21,24,22],[24,24,28,24],[25,7,25,8],[25,21,25,22],[26,1,26,3],[26,7,26,8],[26,15,26,17],[26,21,26,22],[27,1,28,3],[27,7,27,8],[27,15,28,17],[27,21,27,22],[28,7,28,8],[28,21,28,22],[29,7,29,8],[29,21,29,22],[30,1,30,3],[30,7,30,8],[30,15,30,17],[30,21,30,22],[31,1,32,3],[31,7,31,8],[31,10,35,10],[31,15,32,17],[31,21,31,22],[31,24,35,24],[32,7,32,8],[32,21,32,22],[33,1,33,3],[33,7,33,8],[33,15,33,17],[33,21,33,22],[34,1,35,3],[34,7,34,8],[34,15,35,17],[34,21,34,22],[35,7,35,8],[35,21,35,22],[36,7,36,8],[36,21,36,22],[37,1,37,3],[37,7,37,8],[37,15,37,17],[37,21,37,22],[38,1,39,3],[38,7,38,8],[38,10,42,10],[38,15,39,17],[38,21,38,22],[38,24,42,24],[39,7,39,8],[39,21,39,22],[40,1,40,3],[40,7,40,8],[40,15,40,17],[40,21,40,22],[41,1,42,3],[41,7,41,8],[41,15,42,17],[41,21,41,22],[42,7,42,8],[42,21,42,22],[43,7,43,8],[43,21,43,22],[44,1,44,3],[44,7,44,8],[44,15,44,17],[44,21,44,22],[45,1,46,3],[45,7,45,8],[45,10,49,10],[45,15,46,17],[45,21,45,22],[45,24,49,24],[46,7,46,8],[46,21,46,22],[47,1,47,3],[47,7,47,8],[47,15,47,17],[47,21,47,22],[48,1,49,3],[48,7,48,8],[48,15,49,17],[48,21,48,22],[49,7,49,8],[49,21,49,22],[50,7,50,8],[50,21,50,22],[51,7,51,8],[51,21,51,22],[52,7,52,8],[52,11,52,13],[52,21,52,22],[53,4,53,8],[53,18,53,21],[56,2,56,7],[57,2,57,7],[58,2,58,7],[59,2,59,7],[64,2,64,24],[65,0,65,24],[66,0,66,24],[67,2,67,5],[67,11,67,15],[67,19,67,24],[68,2,68,5],[68,6,68,10],[68,11,68,15],[68,19,68,25]]}
[null,null,null,null,null,null,"Spielleiter: XXXXXX, Tel.: XXXXXX\nE-Mail.: XXXXXXX",null,null,null,null,null,null,null,null,null,null,"Spielbericht"]
[null,null,null,null,"Senioren",null,null,null,null,null,null,null,null,"Land:"]
["Klubspiel",null,null,null,"Frauen",null,null,null,null,null,null,null,null,"Ort:",null,null,null,null,null,null,"Datum:",{"$f":"TODAY()","v":"2020-07-16"}]
["Pokalspiel",null,null,null,"Männer",null,null,null,null,null,null,null,null,"Bahnanlage:"]
["Länderspiel",null,null,null,"U 23",null,null,null,null,null,null,null,null,"Spielbeginn:",null,null,null,null,null,null,"Spielende:"]
[null,null,null,null,"U 18",null,null,null,null,null,null,null,null,"Liga/Klasse:"]
[null,null,null,null,null,null,null,null,null,null,null,"Spiel Nr.",null,null,null,null,null,null,null,null,null,null,null,"Spieltag:"]
[null,null,null,"Heimmannschaft",null,null,null,null,null,null,null,null,null,null,null,null,null,"Gastmannschaft"]
{"$rows_left_out":61}
{"sheet":"Einzelergebnisse","index":1,"n_rows":53,"n_cols":13,"rows_kept":53,"cut":false,"hidden":false,"merged":[[1,0,1,5],[1,7,1,12]]}
[]
[{"$f":"\"Heimmannschaft:     \"&DKB!D8","v":"Heimmannschaft:     Heimmannschaft"},null,null,null,null,null,null,{"$f":"\"Gastmannschaft:     \"&DKB!R8","v":"Gastmannschaft:     Gastmannschaft"}]
[]
["Name","DG","Volle","Abr","Fe","Ges",null,"Name","DG","Volle","Abr","Fe","Ges"]
[{"$f":"DKB!B11","v":0},1,null,{"$f":"SUM(F5-C5)","v":0},null,null,null,{"$f":"DKB!P11","v":0},1,null,{"$f":"SUM(M5-J5)","v":0}]
[null,2,null,{"$f":"SUM(F6-C6)","v":0},null,null,null,null,2,null,{"$f":"SUM(M6-J6)","v":0}]
[{"$f":"DKB!B14","v":0},3,null,{"$f":"SUM(F7-C7)","v":0},null,null,null,{"$f":"DKB!P14","v":0},3,null,{"$f":"SUM(M7-J7)","v":0}]
[null,4,null,{"$f":"SUM(F8-C8)","v":0},null,null,null,null,4,null,{"$f":"SUM(M8-J8)","v":0}]
{"$rows_left_out":46}
{"sheet":"MANNSCHAFTEN+SPIELER","index":2,"n_rows":233,"n_cols":21,"rows_kept":233,"cut":false,"hidden":true,"merged":[[0,0,0,6],[0,14,0,20],[2,1,2,2],[2,3,2,4],[2,5,2,6],[2,15,2,16],[2,17,2,18],[2,19,2,20],[23,1,23,2],[23,3,23,4],[23,5,23,6],[44,1,44,2],[44,3,44,4],[44,5,44,6],[65,1,65,2],[65,3,65,4],[65,5,65,6],[86,1,86,2],[86,3,86,4],[86,5,86,6],[107,1,107,2],[107,3,107,4],[107,5,107,6],[128,1,128,2],[128,3,128,4],[128,5,128,6],[149,1,149,2],[149,3,149,4],[149,5,149,6],[170,1,170,2],[170,3,170,4],[170,5,170,6],[191,1,191,2],[191,3,191,4],[191,5,191,6],[212,1,212,2],[212,3,212,4],[212,5,212,6]]}
["Gastmannschaften",null,null,null,null,null,null,null,null,null,null,null,null,null,"Heimmannschaft"]
["KLUB / Verein",null,"Mon/Jahr",null,"Paß-     Nummer",null,"Vorname, Name",null,null,null,null,null,null,null,"KLUB / Verein",null,"Mon/Jahr",null,"Paß-     Nummer",null,"Vorname, Name"]
["Dresdner SV 1910",1,null,1,null,1,null,null,null,null,null,null,null,null,"Königswarthaer SV",1,null,1,null,1]
[{"$f":"$A$3","v":"Dresdner SV 1910"},2,null,2,null,2,"Stefan Pogodda",null,null,null,null,null,null,null,{"$f":"$O$3","v":"Königswarthaer SV"},2,33,2,12345,2,"Alexander Grimmer"]
[{"$f":"$A$3","v":"Dresdner SV 1910"},3,null,3,null,3,"Veit Maruschke",null,null,null,null,null,null,null,{"$f":"$O$3","v":"Königswarthaer SV"},3,44,3,23456,3,"Jonas Kubitz"]
[{"$f":"$A$3","v":"Dresdner SV 1910"},4,null,4,null,4,"Andreas Kirsch",null,null,null,null,null,null,null,{"$f":"$O$3","v":"Königswarthaer SV"},4,22,4,34567,4,"Jonas Scholze"]
[{"$f":"$A$3","v":"Dresdner SV 1910"},5,null,5,null,5,"Kevin Nagy",null,null,null,null,null,null,null,{"$f":"$O$3","v":"Königswarthaer SV"},5,11,5,45678,5,"Georg Paschke"]
[{"$f":"$A$3","v":"Dresdner SV 1910"},6,null,6,null,6,"Sebastian Voll",null,null,null,null,null,null,null,{"$f":"$O$3","v":"Königswarthaer SV"},6,33,6,56789,6,"Tobias Spille"]
{"$rows_left_out":226}
{"sheet":"Beamer_1","index":3,"n_rows":48,"n_cols":17,"rows_kept":48,"cut":false,"hidden":false,"merged":[[0,0,0,6],[0,7,0,9],[0,10,0,16],[1,7,2,9],[3,0,4,0],[3,6,8,6],[3,10,8,10],[3,16,4,16],[4,7,4,9],[6,0,7,0],[6,7,6,9],[6,16,7,16],[8,7,8,9],[9,7,11,9],[10,0,11,0],[10,6,15,6],[10,10,15,10],[10,16,11,16],[13,0,14,0],[13,7,13,9],[13,16,14,16],[15,7,15,9],[17,0,18,0],[17,6,22,6],[17,10,22,10],[17,16,18,16],[18,7,18,9],[20,0,21,0],[20,7,20,9],[20,16,21,16],[24,0,25,0],[24,6,29,6],[24,10,29,10],[24,16,25,16],[27,0,28,0],[27,16,28,16],[31,0,32,0],[31,6,36,6],[31,10,36,10],[31,16,32,16],[32,7,32,9],[34,0,35,0],[34,7,34,9],[34,16,35,16],[38,0,39,0],[38,6,43,6],[38,10,43,10],[38,16,39,16],[41,0,42,0],[41,16,42,16],[44,0,45,2],[44,3,45,3],[44,4,45,4],[44,5,45,5],[44,6,45,6],[44,7,45,9],[44,10,45,10],[44,11,45,11],[44,12,45,12],[44,13,45,13],[44,14,45,16],[46,0,46,2],[46,4,46,5],[46,7,46,9],[46,11,46,12],[46,14,46,16],[47,0,47,2],[47,14,47,16]]}
[{"$f":"\"Heimmannschaft:     \"&DKB!D8","v":"Heimmannschaft:     Heimmannschaft"},null,null,null,null,null,null,"Spiele Nummer",null,null,{"$f":"\"Gastmannschaft:     \"&DKB!R8","v":"Gastmannschaft:     Gastmannschaft"}]
[null,null,null,null,null,null,null,{"$f":"DKB!L8","v":0}]
["Name","DG",1,2,3,4,"MP",null,null,null,"MP",4,3,2,1,"DG","Name"]
[{"$f":"DKB!B11","v":0},null,null,null,null,null,{"$f":"DKB!K11","v":""},null,null,null,{"$f":"DKB!Y11","v":""},null,null,null,null,null,{"$f":"DKB!P11","v":0}]
[null,null,{"$f":"DKB!H11","v":""},{"$f":"DKB!H12","v":""},{"$f":"DKB!H14","v":""},{"$f":"DKB!H15","v":""},null,null,null,null,null,{"$f":"DKB!V15","v":""},{"$f":"DKB!V14","v":""},{"$f":"DKB!V12","v":""},{"$f":"DKB!V11","v":""}]
[]
[{"$f":"DKB!B14","v":0},"SP",{"$f":"DKB!J11","v":""},{"$f":"DKB!J12","v":""},{"$f":"DKB!J14","v":""},{"$f":"DKB!J15","v":""},null,null,null,null,null,{"$f":"DKB!X15","v":""},{"$f":"DKB!X14","v":""},{"$f":"DKB!X12","v":""},{"$f":"DKB!X11","v":""},"SP",{"$f":"DKB!P14","v":0}]
[null,null,null,null,"Gesamt","SP",null,null,null,null,null,"Gesamt","SP"]
{"$rows_left_out":41}
{"sheet":"Dialog","index":4,"n_rows":0,"n_cols":0,"rows_kept":0,"cut":false,"hidden":true,"merged":[]}

{"sheet":"Dialog2","index":5,"n_rows":0,"n_cols":0,"rows_kept":0,"cut":false,"hidden":true,"merged":[]}

{"sheet":"Dialog3","index":6,"n_rows":0,"n_cols":0,"rows_kept":0,"cut":false,"hidden":true,"merged":[]}

{"sheet":"übertrag","index":7,"n_rows":60,"n_cols":31,"rows_kept":60,"cut":false,"hidden":true,"merged":[[0,16,0,17]]}
[null,null,null,null,null,null,null,null,null,null,"Spieler 1 - 6","Spieler 7 - 12","geb.jahr 1 - 6","geb.jahr 7 - 12 - 6","paß.Nr 1 - 6","paß.Nr 7 - 12","Eingane der Kreuze",null,null,null,null,"Gastmannschaft",null,"Heim",null,null,null,null,null,null,"Spieltag"]
[13,9,9,13,null,4,null,1,2,null,{"$f":"IF(übertrag!$H$2=1,VLOOKUP(übertrag!I2,einsü,2, ),IF($H$2=2,VLOOKUP(übertrag!I2,zweiü,2, ),IF($H$2=3,VLOOKUP(übertrag!I2,dreiü,2, ),IF($H$2=4,VLOOKUP(übertrag!I2,vierü,2, ),IF($H$2=5,VLOOKUP(übertrag!I2,fünfü,2, ),IF($H$2=6,VLOOKUP(übertrag!I2,sechsü,2, ),\"\"))))))","v":"Stefan Pogodda"},{"$f":"IF(übertrag!$H$2=7,VLOOKUP(übertrag!I2,siebenü,2, ),IF($H$2=8,VLOOKUP(übertrag!I2,achtü,2, ),IF($H$2=9,VLOOKUP(übertrag!I2,neunü,2, ),IF($H$2=10,VLOOKUP(übertrag!I2,zehnü,2, ),IF($H$2=11,VLOOKUP(übertrag!I2,elfü,2, ),IF($H$2=12,VLOOKUP(übertrag!I2,Heimü,2, ),\"\"))))))","v":""},{"$f":"IF(übertrag!$H$2=1,VLOOKUP(übertrag!I2,jhg1,2, ),IF($H$2=2,VLOOKUP(übertrag!I2,jhg2,2, ),IF($H$2=3,VLOOKUP(übertrag!I2,jhg3,2, ),IF($H$2=4,VLOOKUP(übertrag!I2,jhg4,2, ),IF($H$2=5,VLOOKUP(übertrag!I2,jhg5,2, ),IF($H$2=6,VLOOKUP(übertrag!I2,jhg6,2, ),\"\"))))))","v":{"$error":"#NAME?"}},{"$f":"IF(übertrag!$H$2=7,VLOOKUP(übertrag!I2,jhg7,2, ),IF($H$2=8,VLOOKUP(übertrag!I2,jhg8,2, ),IF($H$2=9,VLOOKUP(übertrag!I2,jhg9,2, ),IF($H$2=10,VLOOKUP(übertrag!I2,jhg10,2, ),IF($H$2=11,VLOOKUP(übertrag!I2,jhg11,2, ),IF($H$2=12,VLOOKUP(übertrag!I2,jhgheim,2, ),\"\"))))))","v":""},{"$f":"IF(übertrag!$H$2=1,VLOOKUP(übertrag!I2,paß1,2, ),IF($H$2=2,VLOOKUP(übertrag!I2,paß2,2, ),IF($H$2=3,VLOOKUP(übertrag!I2,paß3,2, ),IF($H$2=4,VLOOKUP(übertrag!I2,paß4,2, ),IF($H$2=5,VLOOKUP(übertrag!I2,paß5,2, ),IF($H$2=6,VLOOKUP(übertrag!I2,paß6,2, ),\"\"))))))","v":0},{"$f":"IF(übertrag!$H$2=7,VLOOKUP(übertrag!I2,paß7,2, ),IF($H$2=8,VLOOKUP(übertrag!I2,paß8,2, ),IF($H$2=9,VLOOKUP(übertrag!I2,paß9,2, ),IF($H$2=10,VLOOKUP(übertrag!I2,paß10,2, ),IF($H$2=11,VLOOKUP(übertrag!I2,paß11,2, ),IF($H$2=12,VLOOKUP(übertrag!I2,paßheim,2, ),\"\"))))))","v":""},{"$f":"FALSE()","v":0},{"$f":"FALSE()","v":0},null,null,1,{"$f":"'MANNSCHAFTEN+SPIELER'!A3","v":"Dresdner SV 1910"},null,null,null,{"$f":"IF(I16,VLOOKUP(übertrag!I16,Heimü,2, ),\"\")","v":"Alexander Grimmer"},null,null,null,null,1]
[13,1,null,13,null,null,null,null,3,null,{"$f":"IF(übertrag!$H$2=1,VLOOKUP(übertrag!I3,einsü,2, ),IF($H$2=2,VLOOKUP(übertrag!I3,zweiü,2, ),IF($H$2=3,VLOOKUP(übertrag!I3,dreiü,2, ),IF($H$2=4,VLOOKUP(übertrag!I3,vierü,2, ),IF($H$2=5,VLOOKUP(übertrag!I3,fünfü,2, ),IF($H$2=6,VLOOKUP(übertrag!I3,sechsü,2, ),\"\"))))))","v":"Veit Maruschke"},{"$f":"IF(übertrag!$H$2=7,VLOOKUP(übertrag!I3,siebenü,2, ),IF($H$2=8,VLOOKUP(übertrag!I3,achtü,2, ),IF($H$2=9,VLOOKUP(übertrag!I3,neunü,2, ),IF($H$2=10,VLOOKUP(übertrag!I3,zehnü,2, ),IF($H$2=11,VLOOKUP(übertrag!I3,elfü,2, ),IF($H$2=12,VLOOKUP(übertrag!I3,Heimü,2, ),\"\"))))))","v":""},{"$f":"IF(übertrag!$H$2=1,VLOOKUP(übertrag!I3,jhg1,2, ),IF($H$2=2,VLOOKUP(übertrag!I3,jhg2,2, ),IF($H$2=3,VLOOKUP(übertrag!I3,jhg3,2, ),IF($H$2=4,VLOOKUP(übertrag!I3,jhg4,2, ),IF($H$2=5,VLOOKUP(übertrag!I3,jhg5,2, ),IF($H$2=6,VLOOKUP(übertrag!I3,jhg6,2, ),\"\"))))))","v":{"$error":"#NAME?"}},{"$f":"IF(übertrag!$H$2=7,VLOOKUP(übertrag!I3,jhg7,2, ),IF($H$2=8,VLOOKUP(übertrag!I3,jhg8,2, ),IF($H$2=9,VLOOKUP(übertrag!I3,jhg9,2, ),IF($H$2=10,VLOOKUP(übertrag!I3,jhg10,2, ),IF($H$2=11,VLOOKUP(übertrag!I3,jhg11,2, ),IF($H$2=12,VLOOKUP(übertrag!I3,jhgheim,2, ),\"\"))))))","v":""},{"$f":"IF(übertrag!$H$2=1,VLOOKUP(übertrag!I3,paß1,2, ),IF($H$2=2,VLOOKUP(übertrag!I3,paß2,2, ),IF($H$2=3,VLOOKUP(übertrag!I3,paß3,2, ),IF($H$2=4,VLOOKUP(übertrag!I3,paß4,2, ),IF($H$2=5,VLOOKUP(übertrag!I3,paß5,2, ),IF($H$2=6,VLOOKUP(übertrag!I3,paß6,2, ),\"\"))))))","v":0},{"$f":"IF(übertrag!$H$2=7,VLOOKUP(übertrag!I3,paß7,2, ),IF($H$2=8,VLOOKUP(übertrag!I3,paß8,2, ),IF($H$2=9,VLOOKUP(übertrag!I3,paß9,2, ),IF($H$2=10,VLOOKUP(übertrag!I3,paß10,2, ),IF($H$2=11,VLOOKUP(übertrag!I3,paß11,2, ),IF($H$2=12,VLOOKUP(übertrag!I3,paßheim,2, ),\"\"))))))","v":""},{"$f":"FALSE()","v":0},{"$f":"FALSE()","v":0},null,null,2,{"$f":"'MANNSCHAFTEN+SPIELER'!A24","v":"KSV Dresden-Leuben 3."},null,null,null,{"$f":"IF(I17,VLOOKUP(übertrag!I17,Heimü,2, ),\"\")","v":"Jonas Kubitz"},null,null,null,null,2]
[13,9,9,13,null,null,null,null,4,null,{"$f":"IF(übertrag!$H$2=1,VLOOKUP(übertrag!I4,einsü,2, ),IF($H$2=2,VLOOKUP(übertrag!I4,zweiü,2, ),IF($H$2=3,VLOOKUP(übertrag!I4,dreiü,2, ),IF($H$2=4,VLOOKUP(übertrag!I4,vierü,2, ),IF($H$2=5,VLOOKUP(übertrag!I4,fünfü,2, ),IF($H$2=6,VLOOKUP(übertrag!I4,sechsü,2, ),\"\"))))))","v":"Andreas Kirsch"},{"$f":"IF(übertrag!$H$2=7,VLOOKUP(übertrag!I4,siebenü,2, ),IF($H$2=8,VLOOKUP(übertrag!I4,achtü,2, ),IF($H$2=9,VLOOKUP(übertrag!I4,neunü,2, ),IF($H$2=10,VLOOKUP(übertrag!I4,zehnü,2, ),IF($H$2=11,VLOOKUP(übertrag!I4,elfü,2, ),IF($H$2=12,VLOOKUP(übertrag!I4,Heimü,2, ),\"\"))))))","v":""},{"$f":"IF(übertrag!$H$2=1,VLOOKUP(übertrag!I4,jhg1,2, ),IF($H$2=2,VLOOKUP(übertrag!I4,jhg2,2, ),IF($H$2=3,VLOOKUP(übertrag!I4,jhg3,2, ),IF($H$2=4,VLOOKUP(übertrag!I4,jhg4,2, ),IF($H$2=5,VLOOKUP(übertrag!I4,jhg5,2, ),IF($H$2=6,VLOOKUP(übertrag!I4,jhg6,2, ),\"\"))))))","v":{"$error":"#NAME?"}},{"$f":"IF(übertrag!$H$2=7,VLOOKUP(übertrag!I4,jhg7,2, ),IF($H$2=8,VLOOKUP(übertrag!I4,jhg8,2, ),IF($H$2=9,VLOOKUP(übertrag!I4,jhg9,2, ),IF($H$2=10,VLOOKUP(übertrag!I4,jhg10,2, ),IF($H$2=11,VLOOKUP(übertrag!I4,jhg11,2, ),IF($H$2=12,VLOOKUP(übertrag!I4,jhgheim,2, ),\"\"))))))","v":""},{"$f":"IF(übertrag!$H$2=1,VLOOKUP(übertrag!I4,paß1,2, ),IF($H$2=2,VLOOKUP(übertrag!I4,paß2,2, ),IF($H$2=3,VLOOKUP(übertrag!I4,paß3,2, ),IF($H$2=4,VLOOKUP(übertrag!I4,paß4,2, ),IF($H$2=5,VLOOKUP(übertrag!I4,paß5,2, ),IF($H$2=6,VLOOKUP(übertrag!I4,paß6,2, ),\"\"))))))","v":0},{"$f":"IF(übertrag!$H$2=7,VLOOKUP(übertrag!I4,paß7,2, ),IF($H$2=8,VLOOKUP(übertrag!I4,paß8,2, ),IF($H$2=9,VLOOKUP(übertrag!I4,paß9,2, ),IF($H$2=10,VLOOKUP(übertrag!I4,paß10,2, ),IF($H$2=11,VLOOKUP(übertrag!I4,paß11,2, ),IF($H$2=12,VLOOKUP(übertrag!I4,paßheim,2, ),\"\"))))))","v":""},{"$f":"FALSE()","v":0},null,null,null,3,{"$f":"'MANNSCHAFTEN+SPIELER'!A45","v":"VfB Hellerau-Klotzsche 2."},null,null,null,{"$f":"IF(I18,VLOOKUP(übertrag!I18,Heimü,2, ),\"\")","v":"Jonas Scholze"},null,null,null,null,3]
[13,1,null,13,null,null,null,null,5,null,{"$f":"IF(übertrag!$H$2=1,VLOOKUP(übertrag!I5,einsü,2, ),IF($H$2=2,VLOOKUP(übertrag!I5,zweiü,2, ),IF($H$2=3,VLOOKUP(übertrag!I5,dreiü,2, ),IF($H$2=4,VLOOKUP(übertrag!I5,vierü,2, ),IF($H$2=5,VLOOKUP(übertrag!I5,fünfü,2, ),IF($H$2=6,VLOOKUP(übertrag!I5,sechsü,2, ),\"\"))))))","v":"Kevin Nagy"},{"$f":"IF(übertrag!$H$2=7,VLOOKUP(übertrag!I5,siebenü,2, ),IF($H$2=8,VLOOKUP(übertrag!I5,achtü,2, ),IF($H$2=9,VLOOKUP(übertrag!I5,neunü,2, ),IF($H$2=10,VLOOKUP(übertrag!I5,zehnü,2, ),IF($H$2=11,VLOOKUP(übertrag!I5,elfü,2, ),IF($H$2=12,VLOOKUP(übertrag!I5,Heimü,2, ),\"\"))))))","v":""},{"$f":"IF(übertrag!$H$2=1,VLOOKUP(übertrag!I5,jhg1,2, ),IF($H$2=2,VLOOKUP(übertrag!I5,jhg2,2, ),IF($H$2=3,VLOOKUP(übertrag!I5,jhg3,2, ),IF($H$2=4,VLOOKUP(übertrag!I5,jhg4,2, ),IF($H$2=5,VLOOKUP(übertrag!I5,jhg5,2, ),IF($H$2=6,VLOOKUP(übertrag!I5,jhg6,2, ),\"\"))))))","v":{"$error":"#NAME?"}},{"$f":"IF(übertrag!$H$2=7,VLOOKUP(übertrag!I5,jhg7,2, ),IF($H$2=8,VLOOKUP(übertrag!I5,jhg8,2, ),IF($H$2=9,VLOOKUP(übertrag!I5,jhg9,2, ),IF($H$2=10,VLOOKUP(übertrag!I5,jhg10,2, ),IF($H$2=11,VLOOKUP(übertrag!I5,jhg11,2, ),IF($H$2=12,VLOOKUP(übertrag!I5,jhgheim,2, ),\"\"))))))","v":""},{"$f":"IF(übertrag!$H$2=1,VLOOKUP(übertrag!I5,paß1,2, ),IF($H$2=2,VLOOKUP(übertrag!I5,paß2,2, ),IF($H$2=3,VLOOKUP(übertrag!I5,paß3,2, ),IF($H$2=4,VLOOKUP(übertrag!I5,paß4,2, ),IF($H$2=5,VLOOKUP(übertrag!I5,paß5,2, ),IF($H$2=6,VLOOKUP(übertrag!I5,paß6,2, ),\"\"))))))","v":0},{"$f":"IF(übertrag!$H$2=7,VLOOKUP(übertrag!I5,paß7,2, ),IF($H$2=8,VLOOKUP(übertrag!I5,paß8,2, ),IF($H$2=9,VLOOKUP(übertrag!I5,paß9,2, ),IF($H$2=10,VLOOKUP(übertrag!I5,paß10,2, ),IF($H$2=11,VLOOKUP(übertrag!I5,paß11,2, ),IF($H$2=12,VLOOKUP(übertrag!I5,paßheim,2, ),\"\"))))))","v":""},{"$f":"FALSE()","v":0},null,null,null,4,{"$f":"'MANNSCHAFTEN+SPIELER'!A66","v":"Kegelfreunde Dresden 1."},null,null,null,{"$f":"IF(I19,VLOOKUP(übertrag!I19,Heimü,2, ),\"\")","v":"Georg Paschke"},null,null,null,null,4]
[13,9,9,13,null,null,null,null,6,null,{"$f":"IF(übertrag!$H$2=1,VLOOKUP(übertrag!I6,einsü,2, ),IF($H$2=2,VLOOKUP(übertrag!I6,zweiü,2, ),IF($H$2=3,VLOOKUP(übertrag!I6,dreiü,2, ),IF($H$2=4,VLOOKUP(übertrag!I6,vierü,2, ),IF($H$2=5,VLOOKUP(übertrag!I6,fünfü,2, ),IF($H$2=6,VLOOKUP(übertrag!I6,sechsü,2, ),\"\"))))))","v":"Sebastian Voll"},{"$f":"IF(übertrag!$H$2=7,VLOOKUP(übertrag!I6,siebenü,2, ),IF($H$2=8,VLOOKUP(übertrag!I6,achtü,2, ),IF($H$2=9,VLOOKUP(übertrag!I6,neunü,2, ),IF($H$2=10,VLOOKUP(übertrag!I6,zehnü,2, ),IF($H$2=11,VLOOKUP(übertrag!I6,elfü,2, ),IF($H$2=12,VLOOKUP(übertrag!I6,Heimü,2, ),\"\"))))))","v":""},{"$f":"IF(übertrag!$H$2=1,VLOOKUP(übertrag!I6,jhg1,2, ),IF($H$2=2,VLOOKUP(übertrag!I6,jhg2,2, ),IF($H$2=3,VLOOKUP(übertrag!I6,jhg3,2, ),IF($H$2=4,VLOOKUP(übertrag!I6,jhg4,2, ),IF($H$2=5,VLOOKUP(übertrag!I6,jhg5,2, ),IF($H$2=6,VLOOKUP(übertrag!I6,jhg6,2, ),\"\"))))))","v":{"$error":"#NAME?"}},{"$f":"IF(übertrag!$H$2=7,VLOOKUP(übertrag!I6,jhg7,2, ),IF($H$2=8,VLOOKUP(übertrag!I6,jhg8,2, ),IF($H$2=9,VLOOKUP(übertrag!I6,jhg9,2, ),IF($H$2=10,VLOOKUP(übertrag!I6,jhg10,2, ),IF($H$2=11,VLOOKUP(übertrag!I6,jhg11,2, ),IF($H$2=12,VLOOKUP(übertrag!I6,jhgheim,2, ),\"\"))))))","v":""},{"$f":"IF(übertrag!$H$2=1,VLOOKUP(übertrag!I6,paß1,2, ),IF($H$2=2,VLOOKUP(übertrag!I6,paß2,2, ),IF($H$2=3,VLOOKUP(übertrag!I6,paß3,2, ),IF($H$2=4,VLOOKUP(übertrag!I6,paß4,2, ),IF($H$2=5,VLOOKUP(übertrag!I6,paß5,2, ),IF($H$2=6,VLOOKUP(übertrag!I6,paß6,2, ),\"\"))))))","v":0},{"$f":"IF(übertrag!$H$2=7,VLOOKUP(übertrag!I6,paß7,2, ),IF($H$2=8,VLOOKUP(übertrag!I6,paß8,2, ),IF($H$2=9,VLOOKUP(übertrag!I6,paß9,2, ),IF($H$2=10,VLOOKUP(übertrag!I6,paß10,2, ),IF($H$2=11,VLOOKUP(übertrag!I6,paß11,2, ),IF($H$2=12,VLOOKUP(übertrag!I6,paßheim,2, ),\"\"))))))","v":""},{"$f":"FALSE()","v":0},null,null,null,5,{"$f":"'MANNSCHAFTEN+SPIELER'!A87","v":"Kegelfreunde Dresden 2."},null,null,null,{"$f":"IF(I20,VLOOKUP(übertrag!I20,Heimü,2, ),\"\")","v":"Tobias Spille"},null,null,null,null,5]
[13,1,null,13,null,null,null,null,7,null,{"$f":"IF(übertrag!$H$2=1,VLOOKUP(übertrag!I7,einsü,2, ),IF($H$2=2,VLOOKUP(übertrag!I7,zweiü,2, ),IF($H$2=3,VLOOKUP(übertrag!I7,dreiü,2, ),IF($H$2=4,VLOOKUP(übertrag!I7,vierü,2, ),IF($H$2=5,VLOOKUP(übertrag!I7,fünfü,2, ),IF($H$2=6,VLOOKUP(übertrag!I7,sechsü,2, ),\"\"))))))","v":"Robert Nake"},{"$f":"IF(übertrag!$H$2=7,VLOOKUP(übertrag!I7,siebenü,2, ),IF($H$2=8,VLOOKUP(übertrag!I7,achtü,2, ),IF($H$2=9,VLOOKUP(übertrag!I7,neunü,2, ),IF($H$2=10,VLOOKUP(übertrag!I7,zehnü,2, ),IF($H$2=11,VLOOKUP(übertrag!I7,elfü,2, ),IF($H$2=12,VLOOKUP(übertrag!I7,Heimü,2, ),\"\"))))))","v":""},{"$f":"IF(übertrag!$H$2=1,VLOOKUP(übertrag!I7,jhg1,2, ),IF($H$2=2,VLOOKUP(übertrag!I7,jhg2,2, ),IF($H$2=3,VLOOKUP(übertrag!I7,jhg3,2, ),IF($H$2=4,VLOOKUP(übertrag!I7,jhg4,2, ),IF($H$2=5,VLOOKUP(übertrag!I7,jhg5,2, ),IF($H$2=6,VLOOKUP(übertrag!I7,jhg6,2, ),\"\"))))))","v":{"$error":"#NAME?"}},{"$f":"IF(übertrag!$H$2=7,VLOOKUP(übertrag!I7,jhg7,2, ),IF($H$2=8,VLOOKUP(übertrag!I7,jhg8,2, ),IF($H$2=9,VLOOKUP(übertrag!I7,jhg9,2, ),IF($H$2=10,VLOOKUP(übertrag!I7,jhg10,2, ),IF($H$2=11,VLOOKUP(übertrag!I7,jhg11,2, ),IF($H$2=12,VLOOKUP(übertrag!I7,jhgheim,2, ),\"\"))))))","v":""},{"$f":"IF(übertrag!$H$2=1,VLOOKUP(übertrag!I7,paß1,2, ),IF($H$2=2,VLOOKUP(übertrag!I7,paß2,2, ),IF($H$2=3,VLOOKUP(übertrag!I7,paß3,2, ),IF($H$2=4,VLOOKUP(übertrag!I7,paß4,2, ),IF($H$2=5,VLOOKUP(übertrag!I7,paß5,2, ),IF($H$2=6,VLOOKUP(übertrag!I7,paß6,2, ),\"\"))))))","v":0},{"$f":"IF(übertrag!$H$2=7,VLOOKUP(übertrag!I7,paß7,2, ),IF($H$2=8,VLOOKUP(übertrag!I7,paß8,2, ),IF($H$2=9,VLOOKUP(übertrag!I7,paß9,2, ),IF($H$2=10,VLOOKUP(übertrag!I7,paß10,2, ),IF($H$2=11,VLOOKUP(übertrag!I7,paß11,2, ),IF($H$2=12,VLOOKUP(übertrag!I7,paßheim,2, ),\"\"))))))","v":""},{"$f":"FALSE()","v":0},null,null,null,6,{"$f":"'MANNSCHAFTEN+SPIELER'!A108","v":"Gastmannschaft 6"},null,null,null,{"$f":"IF(I21,VLOOKUP(übertrag!I21,Heimü,2, ),\"\")","v":"Sven Peter"},null,null,null,null,6]
[13,9,9,13,null,null,null,null,1,null,{"$f":"IF(übertrag!$H$2=1,VLOOKUP(übertrag!I8,einsü,2, ),IF($H$2=2,VLOOKUP(übertrag!I8,zweiü,2, ),IF($H$2=3,VLOOKUP(übertrag!I8,dreiü,2, ),IF($H$2=4,VLOOKUP(übertrag!I8,vierü,2, ),IF($H$2=5,VLOOKUP(übertrag!I8,fünfü,2, ),IF($H$2=6,VLOOKUP(übertrag!I8,sechsü,2, ),\"\"))))))","v":0},{"$f":"IF(übertrag!$H$2=7,VLOOKUP(übertrag!I8,siebenü,2, ),IF($H$2=8,VLOOKUP(übertrag!I8,achtü,2, ),IF($H$2=9,VLOOKUP(übertrag!I8,neunü,2, ),IF($H$2=10,VLOOKUP(übertrag!I8,zehnü,2, ),IF($H$2=11,VLOOKUP(übertrag!I8,elfü,2, ),IF($H$2=12,VLOOKUP(übertrag!I8,Heimü,2, ),\"\"))))))","v":""},{"$f":"IF(übertrag!$H$2=1,VLOOKUP(übertrag!I8,jhg1,2, ),IF($H$2=2,VLOOKUP(übertrag!I8,jhg2,2, ),IF($H$2=3,VLOOKUP(übertrag!I8,jhg3,2, ),IF($H$2=4,VLOOKUP(übertrag!I8,jhg4,2, ),IF($H$2=5,VLOOKUP(übertrag!I8,jhg5,2, ),IF($H$2=6,VLOOKUP(übertrag!I8,jhg6,2, ),\"\"))))))","v":{"$error":"#NAME?"}},{"$f":"IF(übertrag!$H$2=7,VLOOKUP(übertrag!I8,jhg7,2, ),IF($H$2=8,VLOOKUP(übertrag!I8,jhg8,2, ),IF($H$2=9,VLOOKUP(übertrag!I8,jhg9,2, ),IF($H$2=10,VLOOKUP(übertrag!I8,jhg10,2, ),IF($H$2=11,VLOOKUP(übertrag!I8,jhg11,2, ),IF($H$2=12,VLOOKUP(übertrag!I8,jhgheim,2, ),\"\"))))))","v":""},{"$f":"IF(übertrag!$H$2=1,VLOOKUP(übertrag!I8,paß1,2, ),IF($H$2=2,VLOOKUP(übertrag!I8,paß2,2, ),IF($H$2=3,VLOOKUP(übertrag!I8,paß3,2, ),IF($H$2=4,VLOOKUP(übertrag!I8,paß4,2, ),IF($H$2=5,VLOOKUP(übertrag!I8,paß5,2, ),IF($H$2=6,VLOOKUP(übertrag!I8,paß6,2, ),\"\"))))))","v":0},{"$f":"IF(übertrag!$H$2=7,VLOOKUP(übertrag!I8,paß7,2, ),IF($H$2=8,VLOOKUP(übertrag!I8,paß8,2, ),IF($H$2=9,VLOOKUP(übertrag!I8,paß9,2, ),IF($H$2=10,VLOOKUP(übertrag!I8,paß10,2, ),IF($H$2=11,VLOOKUP(übertrag!I8,paß11,2, ),IF($H$2=12,VLOOKUP(übertrag!I8,paßheim,2, ),\"\"))))))","v":""},{"$f":"FALSE()","v":0},null,null,null,7,{"$f":"'MANNSCHAFTEN+SPIELER'!A129","v":"Gastmannschaft 7"},null,null,null,{"$f":"IF(I22,VLOOKUP(übertrag!I22,Heimü,2, ),\"\")","v":0},null,null,null,null,7]
{"$rows_left_out":52}